Bitcoin Forum
October 22, 2021, 05:21:08 PM *
News: Latest Bitcoin Core release: 22.0 [Torrent]
 
   Home   Help Search Login Register More  
Pages: « 1 ... 912 913 914 915 916 917 918 919 920 921 922 923 924 925 926 927 928 929 930 931 932 933 934 935 936 937 938 939 940 941 942 943 944 945 946 947 948 949 950 951 952 953 954 955 956 957 958 959 960 961 [962] 963 964 965 966 967 968 969 970 971 972 973 974 975 976 977 978 979 980 981 982 983 984 985 986 987 988 989 990 991 992 993 994 995 996 997 998 999 1000 1001 1002 1003 1004 1005 1006 1007 1008 1009 1010 1011 1012 ... 1243 »
  Print  
Author Topic: ★[ANN] [NAV] NAV COIN - Community Fund Live!!!  (Read 2083038 times)
This is a self-moderated topic. If you do not want to be moderated by the person who started this topic, create a new topic.
greebdork
Newbie
*
Offline Offline

Activity: 4
Merit: 0


View Profile
September 13, 2016, 08:51:08 AM
 #19221

I am unable to broadcast a transactions on new thin wallet, using windows 10x64. Electrum returns error: {u'message': u'NAV rejected', u'code': -22}

I have just tested and it worked for me. On the Android and electrum windows.

Are you sure you had the correct password? Any more information would be great.

regards
Shahim
Yes, the password is correct i checked it multiple times. What kind of information is required? I'm trying to send 100 NAV to my poloniex depo address. Recieving worked just fine. I didn't touch any network preferences and i'd like to know what error code means.
Advertised sites are not endorsed by the Bitcoin Forum. They may be unsafe, untrustworthy, or illegal in your jurisdiction. Advertise here.
1634923268
Hero Member
*
Offline Offline

Posts: 1634923268

View Profile Personal Message (Offline)

Ignore
1634923268
Reply with quote  #2

1634923268
Report to moderator
1634923268
Hero Member
*
Offline Offline

Posts: 1634923268

View Profile Personal Message (Offline)

Ignore
1634923268
Reply with quote  #2

1634923268
Report to moderator
1634923268
Hero Member
*
Offline Offline

Posts: 1634923268

View Profile Personal Message (Offline)

Ignore
1634923268
Reply with quote  #2

1634923268
Report to moderator
arseaboy
Hero Member
*****
Offline Offline

Activity: 644
Merit: 500



View Profile
September 13, 2016, 08:55:21 AM
 #19222

I think it's brand new. We will wait before adding it to the exchanges page, but if it is legit, it opens up some great possibilities for people to buy NAV without having to buy BTC first!

I just ask everybody to be very cautious with new exchanges. There has been already a few scam exchanges, that close and run. They have a thread here on bitcointalk, which I would follow!
we cant control this because of some traders also love to do arbitrage ways of trading looking for easy profits but thank you dev for your concern about this more power to your project and keep it up. 

██████████████████████  ▀███▄          ▄██▄          ▄██████▄   █████████████████████████
▀▀▀▀▀▀▀▀▀▀▀▀▀▀▀▀▀▀▀▀▀▀   ▀███▄        ▄████▄        ▄███▀▀███▄   █████████████████████████
                          ▀███▄      ▄██████▄      ▄███▀  ▀███▄       ▐███       ███▌
                           ▀███▄    ▄███▀▀███▄    ▄███▀    ▀███▄      ▐███       ███▌
   █████████████████        ▀███▄  ▄███▀  ▀███▄  ▄███▀      ▀███▄     ▐███       ███▌
                             ▀███▄▄███▀    ▀███▄▄███▀        ▀███▄    ▐███       ███▌
                              ▀██████▀      ▀██████▀          ▀███▄   ▐███       ███▌
▄▄▄▄▄▄▄▄▄▄▄▄▄▄▄▄▄▄▄▄▄▄         ▀████▀        ▀████▀            ▀███▄  ▐███       ███▌
██████████████████████          ▀██▀          ▀██▀              ▀███▄ ▐███       ███▌

.
R E I M A G I N I N G    E N E R G Y
█▄
▄█████▄
▄████▀████▄
▄█████▌ ▐█████▄
▄███▀▀██▌ ▐██▀▀███▄
▄█████▄  ▀▌ ▐▀  ▄█████▄
█████████▄     ▄█████████
██████  ▀██▌ ▐██▀  ██████
▀██████▄  ▀▌ ▐▀  ▄██████▀
▀███████▄     ▄███████▀
▀▀██████▌ ▐██████▀▀
▀▀▀▀▄█▄▀▀▀▀
█████
[.
TELEGRAM    MEDIUM
.
TWITTER   FACEBOOK
]███
███
███
███
███
███
███
███
███
███
███
███
███
███
███

███
███
███
███
███
███
███


███
███
[PRE-SALE]
C O M I N G 
SOON███
███

███
███
███
███
███
███
███


███
███
███
███
███
███
███
███
███
███
███
███
███
███
███
for everet
Member
**
Offline Offline

Activity: 98
Merit: 10


View Profile
September 13, 2016, 09:07:21 AM
 #19223

8.5k, .... Huh Huh Huh Huh.stop here,
yavuzc78
Hero Member
*****
Offline Offline

Activity: 868
Merit: 1000


View Profile
September 13, 2016, 09:26:16 AM
 #19224

dont sell nav it will go 15k

shahim
Legendary
*
Offline Offline

Activity: 1082
Merit: 1002


View Profile
September 13, 2016, 09:27:16 AM
 #19225

I am unable to broadcast a transactions on new thin wallet, using windows 10x64. Electrum returns error: {u'message': u'NAV rejected', u'code': -22}

I have just tested and it worked for me. On the Android and electrum windows.

Are you sure you had the correct password? Any more information would be great.

regards
Shahim
Yes, the password is correct i checked it multiple times. What kind of information is required? I'm trying to send 100 NAV to my poloniex depo address. Recieving worked just fine. I didn't touch any network preferences and i'd like to know what error code means.

And the wallet is also showing green connection status in the right status bar?

We think there is a network connection problem. Servers to connect are mobile.navcoin.org and mobile2.navcoin.org.

You can use ssl or without ssl. Check that inside the preferences.
greebdork
Newbie
*
Offline Offline

Activity: 4
Merit: 0


View Profile
September 13, 2016, 09:29:38 AM
 #19226

Ooookay, i seemed to be able to fix it after lurking for electrum error -22, it seems that Electrum doesn't calculate fees right/or cannot process fees below minimum, either way, making a default fee 0.003 NAV instead of 0.00001 and sending lesser amount of coins worked.
DragonBall Fan
Newbie
*
Offline Offline

Activity: 31
Merit: 0


View Profile
September 13, 2016, 12:19:36 PM
 #19227


You're definitely on master branch right?

Can you please pull master again? i just updated some missing locale files that were accidentally added to my gitignore.
Yes, I downloaded the master from here again: https://github.com/navcoindev/navcoin2/tree/master

I can't reproduce the problem here, but I have also all the libraries to compile bitcoin, so perhaps something in there is missing for you?

You could try adding the bitcoin build dependencies:

Code:
sudo apt-get install build-essential libtool autotools-dev automake pkg-config libssl-dev libevent-dev bsdmainutils
sudo apt-get install libboost-all-dev
sudo add-apt-repository ppa:bitcoin/bitcoin
sudo apt-get update
sudo apt-get install libdb4.8-dev libdb4.8++-dev libzmq3-dev libgmp3-dev libminiupnpc-dev
Ok, I installed it.
To reproduce it should be easy I think
I try it on a fresh installed linux mint 18 cinnamon 64bit without propitary software in a virtualbox.

in fact, try this. It works for me every time when i have to reinstall my VM. Starting from the root directory you checked out the project to eg. ~/navcoin2/

Code:
sudo apt-get install build-essential libtool autotools-dev automake pkg-config libssl-dev libevent-dev bsdmainutils libboost-all-dev
sudo add-apt-repository ppa:bitcoin/bitcoin
sudo apt-get update
sudo apt-get install libdb4.8-dev libdb4.8++-dev libzmq3-dev libgmp3-dev libminiupnpc-dev
rm -r src/obj
mkdir src/obj
mkdir src/obj/crypto
mkdir src/obj/support
sudo chmod 755 src/leveldb/build_detect_platform
rm -r src/secp256k1/
cd src
wget www.navajocoin.org/files/secp.zip
unzip secp.zip
cd secp256k1
sudo chmod 777 *
./autogen.sh
./configure --enable-module-recovery
make
cd ..
make -f makefile.unix clean
make -f makefile.unix USE_UPNP=1

If this works for you, I will update the linux build instructions.

I follow your way, but it still does not work.
Output:
Code:
node@node-VirtualBox /navcoin2-master $ sudo rm -r src/obj
node@node-VirtualBox /navcoin2-master $ sudo mkdir src/obj
node@node-VirtualBox /navcoin2-master $ sudo mkdir src/obj/crypto
node@node-VirtualBox /navcoin2-master $ sudo mkdir src/obj/support
node@node-VirtualBox /navcoin2-master $ sudo chmod 755 src/leveldb/build_detect_platform
node@node-VirtualBox /navcoin2-master $ sudo rm -r src/secp256k1/
node@node-VirtualBox /navcoin2-master $ cd src
node@node-VirtualBox /navcoin2-master/src $ sudo wget www.navajocoin.org/files/secp.zip
--2016-09-13 13:42:00--  http://www.navajocoin.org/files/secp.zip
Resolving www.navajocoin.org (www.navajocoin.org)... 185.61.148.209
Connecting to www.navajocoin.org (www.navajocoin.org)|185.61.148.209|:80... connected.
HTTP request sent, awaiting response... 301 Moved Permanently
Location: http://www.navcoin.org/files/secp.zip [following]
--2016-09-13 13:42:00--  http://www.navcoin.org/files/secp.zip
Resolving www.navcoin.org (www.navcoin.org)... 185.61.148.209
Reusing existing connection to www.navajocoin.org:80.
HTTP request sent, awaiting response... 200 OK
Length: 171484 (167K) [application/zip]
Saving to: ‘secp.zip’

secp.zip            100%[===================>] 167.46K   713KB/s    in 0.2s   

2016-09-13 13:42:01 (713 KB/s) - ‘secp.zip’ saved [171484/171484]

node@node-VirtualBox /navcoin2-master/src $ sudo unzip secp.zip
Archive:  secp.zip
   creating: secp256k1/
  inflating: secp256k1/.gitignore   
  inflating: secp256k1/.travis.yml   
  inflating: secp256k1/autogen.sh   
   creating: secp256k1/build-aux/
   creating: secp256k1/build-aux/m4/
  inflating: secp256k1/build-aux/m4/ax_prog_cc_for_build.m4 
  inflating: secp256k1/build-aux/m4/bitcoin_secp.m4 
  inflating: secp256k1/configure.ac 
   creating: secp256k1/contrib/
  inflating: secp256k1/contrib/lax_der_parsing.c 
  inflating: secp256k1/contrib/lax_der_parsing.h 
  inflating: secp256k1/contrib/lax_der_privatekey_parsing.c 
  inflating: secp256k1/contrib/lax_der_privatekey_parsing.h 
  inflating: secp256k1/COPYING       
   creating: secp256k1/include/
  inflating: secp256k1/include/secp256k1.h 
  inflating: secp256k1/include/secp256k1_ecdh.h 
  inflating: secp256k1/include/secp256k1_recovery.h 
  inflating: secp256k1/include/secp256k1_schnorr.h 
  inflating: secp256k1/libsecp256k1.pc.in 
  inflating: secp256k1/Makefile.am   
   creating: secp256k1/obj/
 extracting: secp256k1/obj/.gitignore 
  inflating: secp256k1/README.md     
   creating: secp256k1/sage/
  inflating: secp256k1/sage/group_prover.sage 
  inflating: secp256k1/sage/secp256k1.sage 
  inflating: secp256k1/sage/weierstrass_prover.sage 
   creating: secp256k1/src/
  inflating: secp256k1/src/basic-config.h 
  inflating: secp256k1/src/bench.h   
  inflating: secp256k1/src/bench_ecdh.c 
  inflating: secp256k1/src/bench_internal.c 
  inflating: secp256k1/src/bench_recover.c 
  inflating: secp256k1/src/bench_schnorr_verify.c 
  inflating: secp256k1/src/bench_sign.c 
  inflating: secp256k1/src/bench_verify.c 
  inflating: secp256k1/src/ecdsa.h   
  inflating: secp256k1/src/ecdsa_impl.h 
  inflating: secp256k1/src/eckey.h   
  inflating: secp256k1/src/eckey_impl.h 
  inflating: secp256k1/src/ecmult.h 
  inflating: secp256k1/src/ecmult_const.h 
  inflating: secp256k1/src/ecmult_const_impl.h 
  inflating: secp256k1/src/ecmult_gen.h 
  inflating: secp256k1/src/ecmult_gen_impl.h 
  inflating: secp256k1/src/ecmult_impl.h 
  inflating: secp256k1/src/field.h   
  inflating: secp256k1/src/field_10x26.h 
  inflating: secp256k1/src/field_10x26_impl.h 
  inflating: secp256k1/src/field_5x52.h 
  inflating: secp256k1/src/field_5x52_asm_impl.h 
  inflating: secp256k1/src/field_5x52_impl.h 
  inflating: secp256k1/src/field_5x52_int128_impl.h 
  inflating: secp256k1/src/field_impl.h 
  inflating: secp256k1/src/gen_context.c 
  inflating: secp256k1/src/group.h   
  inflating: secp256k1/src/group_impl.h 
  inflating: secp256k1/src/hash.h   
  inflating: secp256k1/src/hash_impl.h 
   creating: secp256k1/src/java/
   creating: secp256k1/src/java/org/
   creating: secp256k1/src/java/org/bitcoin/
  inflating: secp256k1/src/java/org/bitcoin/NativeSecp256k1.java 
  inflating: secp256k1/src/java/org_bitcoin_NativeSecp256k1.c 
  inflating: secp256k1/src/java/org_bitcoin_NativeSecp256k1.h 
   creating: secp256k1/src/modules/
   creating: secp256k1/src/modules/ecdh/
  inflating: secp256k1/src/modules/ecdh/main_impl.h 
  inflating: secp256k1/src/modules/ecdh/Makefile.am.include 
  inflating: secp256k1/src/modules/ecdh/tests_impl.h 
   creating: secp256k1/src/modules/recovery/
  inflating: secp256k1/src/modules/recovery/main_impl.h 
  inflating: secp256k1/src/modules/recovery/Makefile.am.include 
  inflating: secp256k1/src/modules/recovery/tests_impl.h 
   creating: secp256k1/src/modules/schnorr/
  inflating: secp256k1/src/modules/schnorr/main_impl.h 
  inflating: secp256k1/src/modules/schnorr/Makefile.am.include 
  inflating: secp256k1/src/modules/schnorr/schnorr.h 
  inflating: secp256k1/src/modules/schnorr/schnorr_impl.h 
  inflating: secp256k1/src/modules/schnorr/tests_impl.h 
  inflating: secp256k1/src/num.h     
  inflating: secp256k1/src/num_gmp.h 
  inflating: secp256k1/src/num_gmp_impl.h 
  inflating: secp256k1/src/num_impl.h 
  inflating: secp256k1/src/scalar.h 
  inflating: secp256k1/src/scalar_4x64.h 
  inflating: secp256k1/src/scalar_4x64_impl.h 
  inflating: secp256k1/src/scalar_8x32.h 
  inflating: secp256k1/src/scalar_8x32_impl.h 
  inflating: secp256k1/src/scalar_impl.h 
  inflating: secp256k1/src/secp256k1.c 
  inflating: secp256k1/src/testrand.h 
  inflating: secp256k1/src/testrand_impl.h 
  inflating: secp256k1/src/tests.c   
  inflating: secp256k1/src/util.h   
  inflating: secp256k1/TODO         
node@node-VirtualBox /navcoin2-master/src $ cd secp256k1
node@node-VirtualBox /navcoin2-master/src/secp256k1 $ sudo chmod 777 *
node@node-VirtualBox /navcoin2-master/src/secp256k1 $ sudo ./autogen.sh
libtoolize: putting auxiliary files in AC_CONFIG_AUX_DIR, 'build-aux'.
libtoolize: copying file 'build-aux/ltmain.sh'
libtoolize: putting macros in AC_CONFIG_MACRO_DIRS, 'build-aux/m4'.
libtoolize: copying file 'build-aux/m4/libtool.m4'
libtoolize: copying file 'build-aux/m4/ltoptions.m4'
libtoolize: copying file 'build-aux/m4/ltsugar.m4'
libtoolize: copying file 'build-aux/m4/ltversion.m4'
libtoolize: copying file 'build-aux/m4/lt~obsolete.m4'
configure.ac:10: installing 'build-aux/compile'
configure.ac:5: installing 'build-aux/config.guess'
configure.ac:5: installing 'build-aux/config.sub'
configure.ac:9: installing 'build-aux/install-sh'
configure.ac:9: installing 'build-aux/missing'
Makefile.am: installing 'build-aux/depcomp'
parallel-tests: installing 'build-aux/test-driver'
node@node-VirtualBox /navcoin2-master/src/secp256k1 $ sudo ./configure --enable-module-recovery
checking build system type... x86_64-pc-linux-gnu
checking host system type... x86_64-pc-linux-gnu
checking for a BSD-compatible install... /usr/bin/install -c
checking whether build environment is sane... yes
checking for a thread-safe mkdir -p... /bin/mkdir -p
checking for gawk... gawk
checking whether make sets $(MAKE)... yes
checking whether make supports nested variables... yes
checking how to print strings... printf
checking for style of include used by make... GNU
checking for gcc... gcc
checking whether the C compiler works... yes
checking for C compiler default output file name... a.out
checking for suffix of executables...
checking whether we are cross compiling... no
checking for suffix of object files... o
checking whether we are using the GNU C compiler... yes
checking whether gcc accepts -g... yes
checking for gcc option to accept ISO C89... none needed
checking whether gcc understands -c and -o together... yes
checking dependency style of gcc... gcc3
checking for a sed that does not truncate output... /bin/sed
checking for grep that handles long lines and -e... /bin/grep
checking for egrep... /bin/grep -E
checking for fgrep... /bin/grep -F
checking for ld used by gcc... /usr/bin/ld
checking if the linker (/usr/bin/ld) is GNU ld... yes
checking for BSD- or MS-compatible name lister (nm)... /usr/bin/nm -B
checking the name lister (/usr/bin/nm -B) interface... BSD nm
checking whether ln -s works... yes
checking the maximum length of command line arguments... 1572864
checking how to convert x86_64-pc-linux-gnu file names to x86_64-pc-linux-gnu format... func_convert_file_noop
checking how to convert x86_64-pc-linux-gnu file names to toolchain format... func_convert_file_noop
checking for /usr/bin/ld option to reload object files... -r
checking for objdump... objdump
checking how to recognize dependent libraries... pass_all
checking for dlltool... no
checking how to associate runtime and link libraries... printf %s\n
checking for ar... ar
checking for archiver @FILE support... @
checking for strip... strip
checking for ranlib... ranlib
checking command to parse /usr/bin/nm -B output from gcc object... ok
checking for sysroot... no
checking for a working dd... /bin/dd
checking how to truncate binary pipes... /bin/dd bs=4096 count=1
checking for mt... mt
checking if mt is a manifest tool... no
checking how to run the C preprocessor... gcc -E
checking for ANSI C header files... yes
checking for sys/types.h... yes
checking for sys/stat.h... yes
checking for stdlib.h... yes
checking for string.h... yes
checking for memory.h... yes
checking for strings.h... yes
checking for inttypes.h... yes
checking for stdint.h... yes
checking for unistd.h... yes
checking for dlfcn.h... yes
checking for objdir... .libs
checking if gcc supports -fno-rtti -fno-exceptions... no
checking for gcc option to produce PIC... -fPIC -DPIC
checking if gcc PIC flag -fPIC -DPIC works... yes
checking if gcc static flag -static works... yes
checking if gcc supports -c -o file.o... yes
checking if gcc supports -c -o file.o... (cached) yes
checking whether the gcc linker (/usr/bin/ld -m elf_x86_64) supports shared libraries... yes
checking whether -lc should be explicitly linked in... no
checking dynamic linker characteristics... GNU/Linux ld.so
checking how to hardcode library paths into programs... immediate
checking whether stripping libraries is possible... yes
checking if libtool supports shared libraries... yes
checking whether to build shared libraries... yes
checking whether to build static libraries... yes
checking whether make supports nested variables... (cached) yes
checking for pkg-config... /usr/bin/pkg-config
checking pkg-config is at least version 0.9.0... yes
checking for ar... /usr/bin/ar
checking for ranlib... /usr/bin/ranlib
checking for strip... /usr/bin/strip
checking for gcc... gcc
checking whether we are using the GNU C compiler... (cached) yes
checking whether gcc accepts -g... yes
checking for gcc option to accept ISO C89... (cached) none needed
checking whether gcc understands -c and -o together... (cached) yes
checking dependency style of gcc... (cached) gcc3
checking how to run the C preprocessor... gcc -E
checking for gcc option to accept ISO C89... (cached) none needed
checking if gcc supports -std=c89 -pedantic -Wall -Wextra -Wcast-align -Wnested-externs -Wshadow -Wstrict-prototypes -Wno-unused-function -Wno-long-long -Wno-overlength-strings... yes
checking if gcc supports -fvisibility=hidden... yes
checking for __int128... yes
checking for __builtin_expect... yes
checking for x86_64 assembly availability... yes
checking gmp.h usability... yes
checking gmp.h presence... yes
checking for gmp.h... yes
checking for __gmpz_init in -lgmp... yes
checking for CRYPTO... yes
checking for main in -lcrypto... yes
checking for EC functions in libcrypto... yes
checking whether byte ordering is bigendian... no
configure: Using assembly optimizations: x86_64
configure: Using field implementation: 64bit
configure: Using bignum implementation: gmp
configure: Using scalar implementation: 64bit
configure: Using endomorphism optimizations: no
configure: Building ECDSA pubkey recovery module: yes
checking that generated files are newer than configure... done
configure: creating ./config.status
config.status: creating Makefile
config.status: creating libsecp256k1.pc
config.status: creating src/libsecp256k1-config.h
config.status: executing depfiles commands
config.status: executing libtool commands
node@node-VirtualBox /navcoin2-master/src/secp256k1 $ sudo make
gcc -I. -g -O2 -Wall -Wextra -Wno-unused-function -c src/gen_context.c -o gen_context.o
gcc gen_context.o -o gen_context
./gen_context
  CC       src/libsecp256k1_la-secp256k1.lo
  CCLD     libsecp256k1.la
/usr/bin/ar: `u' modifier ignored since `D' is the default (see `U')
  CC       src/tests-tests.o
  CCLD     tests
node@node-VirtualBox /navcoin2-master/src/secp256k1 $ cd ..
node@node-VirtualBox /navcoin2-master/src $ sudo make -f makefile.unix clean
rm -f navcoind
rm -f obj/*.o
rm -f obj/*.P
rm -f obj/build.h
node@node-VirtualBox /navcoin2-master/src $ sudo make -f makefile.unix USE_UPNP=1
g++ -c -O2  -pthread -Wall -Wextra -Wno-ignored-qualifiers -Wformat -Wformat-security -Wno-unused-parameter -Wunused-function -Wunused-variable -fpermissive -Wconversion-null -g -DBOOST_SPIRIT_THREADSAFE -I/navcoin2-master/src -I/navcoin2-master/src/obj -DUSE_UPNP=1 -DENABLE_WALLET -I/navcoin2-master/src/secp256k1/include -I/navcoin2-master/src/leveldb/include -I/navcoin2-master/src/leveldb/helpers -DHAVE_BUILD_INFO -fno-stack-protector -fstack-protector-all -Wstack-protector -D_FORTIFY_SOURCE=2  -MMD -MF obj/alert.d -o obj/alert.o alert.cpp
/bin/sh ../share/genbuild.sh obj/build.h
g++ -c -O2  -pthread -Wall -Wextra -Wno-ignored-qualifiers -Wformat -Wformat-security -Wno-unused-parameter -Wunused-function -Wunused-variable -fpermissive -Wconversion-null -g -DBOOST_SPIRIT_THREADSAFE -I/navcoin2-master/src -I/navcoin2-master/src/obj -DUSE_UPNP=1 -DENABLE_WALLET -I/navcoin2-master/src/secp256k1/include -I/navcoin2-master/src/leveldb/include -I/navcoin2-master/src/leveldb/helpers -DHAVE_BUILD_INFO -fno-stack-protector -fstack-protector-all -Wstack-protector -D_FORTIFY_SOURCE=2  -MMD -MF obj/version.d -o obj/version.o version.cpp
g++ -c -O2  -pthread -Wall -Wextra -Wno-ignored-qualifiers -Wformat -Wformat-security -Wno-unused-parameter -Wunused-function -Wunused-variable -fpermissive -Wconversion-null -g -DBOOST_SPIRIT_THREADSAFE -I/navcoin2-master/src -I/navcoin2-master/src/obj -DUSE_UPNP=1 -DENABLE_WALLET -I/navcoin2-master/src/secp256k1/include -I/navcoin2-master/src/leveldb/include -I/navcoin2-master/src/leveldb/helpers -DHAVE_BUILD_INFO -fno-stack-protector -fstack-protector-all -Wstack-protector -D_FORTIFY_SOURCE=2  -MMD -MF obj/checkpoints.d -o obj/checkpoints.o checkpoints.cpp
g++ -c -O2  -pthread -Wall -Wextra -Wno-ignored-qualifiers -Wformat -Wformat-security -Wno-unused-parameter -Wunused-function -Wunused-variable -fpermissive -Wconversion-null -g -DBOOST_SPIRIT_THREADSAFE -I/navcoin2-master/src -I/navcoin2-master/src/obj -DUSE_UPNP=1 -DENABLE_WALLET -I/navcoin2-master/src/secp256k1/include -I/navcoin2-master/src/leveldb/include -I/navcoin2-master/src/leveldb/helpers -DHAVE_BUILD_INFO -fno-stack-protector -fstack-protector-all -Wstack-protector -D_FORTIFY_SOURCE=2  -MMD -MF obj/netbase.d -o obj/netbase.o netbase.cpp
g++ -c -O2  -pthread -Wall -Wextra -Wno-ignored-qualifiers -Wformat -Wformat-security -Wno-unused-parameter -Wunused-function -Wunused-variable -fpermissive -Wconversion-null -g -DBOOST_SPIRIT_THREADSAFE -I/navcoin2-master/src -I/navcoin2-master/src/obj -DUSE_UPNP=1 -DENABLE_WALLET -I/navcoin2-master/src/secp256k1/include -I/navcoin2-master/src/leveldb/include -I/navcoin2-master/src/leveldb/helpers -DHAVE_BUILD_INFO -fno-stack-protector -fstack-protector-all -Wstack-protector -D_FORTIFY_SOURCE=2  -MMD -MF obj/addrman.d -o obj/addrman.o addrman.cpp
g++ -c -O2  -pthread -Wall -Wextra -Wno-ignored-qualifiers -Wformat -Wformat-security -Wno-unused-parameter -Wunused-function -Wunused-variable -fpermissive -Wconversion-null -g -DBOOST_SPIRIT_THREADSAFE -I/navcoin2-master/src -I/navcoin2-master/src/obj -DUSE_UPNP=1 -DENABLE_WALLET -I/navcoin2-master/src/secp256k1/include -I/navcoin2-master/src/leveldb/include -I/navcoin2-master/src/leveldb/helpers -DHAVE_BUILD_INFO -fno-stack-protector -fstack-protector-all -Wstack-protector -D_FORTIFY_SOURCE=2  -MMD -MF obj/crypter.d -o obj/crypter.o crypter.cpp
g++ -c -O2  -pthread -Wall -Wextra -Wno-ignored-qualifiers -Wformat -Wformat-security -Wno-unused-parameter -Wunused-function -Wunused-variable -fpermissive -Wconversion-null -g -DBOOST_SPIRIT_THREADSAFE -I/navcoin2-master/src -I/navcoin2-master/src/obj -DUSE_UPNP=1 -DENABLE_WALLET -I/navcoin2-master/src/secp256k1/include -I/navcoin2-master/src/leveldb/include -I/navcoin2-master/src/leveldb/helpers -DHAVE_BUILD_INFO -fno-stack-protector -fstack-protector-all -Wstack-protector -D_FORTIFY_SOURCE=2  -MMD -MF obj/key.d -o obj/key.o key.cpp
key.cpp: In member function ‘bool CPubKey::VerifyCompact(const uint256&, const std::vector<unsigned char>&) const’:
key.cpp:632:10: warning: unused variable ‘fComp’ [-Wunused-variable]
     bool fComp = IsCompressed();
          ^
g++ -c -O2  -pthread -Wall -Wextra -Wno-ignored-qualifiers -Wformat -Wformat-security -Wno-unused-parameter -Wunused-function -Wunused-variable -fpermissive -Wconversion-null -g -DBOOST_SPIRIT_THREADSAFE -I/navcoin2-master/src -I/navcoin2-master/src/obj -DUSE_UPNP=1 -DENABLE_WALLET -I/navcoin2-master/src/secp256k1/include -I/navcoin2-master/src/leveldb/include -I/navcoin2-master/src/leveldb/helpers -DHAVE_BUILD_INFO -fno-stack-protector -fstack-protector-all -Wstack-protector -D_FORTIFY_SOURCE=2  -MMD -MF obj/eckey.d -o obj/eckey.o eckey.cpp
g++ -c -O2  -pthread -Wall -Wextra -Wno-ignored-qualifiers -Wformat -Wformat-security -Wno-unused-parameter -Wunused-function -Wunused-variable -fpermissive -Wconversion-null -g -DBOOST_SPIRIT_THREADSAFE -I/navcoin2-master/src -I/navcoin2-master/src/obj -DUSE_UPNP=1 -DENABLE_WALLET -I/navcoin2-master/src/secp256k1/include -I/navcoin2-master/src/leveldb/include -I/navcoin2-master/src/leveldb/helpers -DHAVE_BUILD_INFO -fno-stack-protector -fstack-protector-all -Wstack-protector -D_FORTIFY_SOURCE=2  -MMD -MF obj/init.d -o obj/init.o init.cpp
g++ -c -O2  -pthread -Wall -Wextra -Wno-ignored-qualifiers -Wformat -Wformat-security -Wno-unused-parameter -Wunused-function -Wunused-variable -fpermissive -Wconversion-null -g -DBOOST_SPIRIT_THREADSAFE -I/navcoin2-master/src -I/navcoin2-master/src/obj -DUSE_UPNP=1 -DENABLE_WALLET -I/navcoin2-master/src/secp256k1/include -I/navcoin2-master/src/leveldb/include -I/navcoin2-master/src/leveldb/helpers -DHAVE_BUILD_INFO -fno-stack-protector -fstack-protector-all -Wstack-protector -D_FORTIFY_SOURCE=2  -MMD -MF obj/bitcoind.d -o obj/bitcoind.o bitcoind.cpp
g++ -c -O2  -pthread -Wall -Wextra -Wno-ignored-qualifiers -Wformat -Wformat-security -Wno-unused-parameter -Wunused-function -Wunused-variable -fpermissive -Wconversion-null -g -DBOOST_SPIRIT_THREADSAFE -I/navcoin2-master/src -I/navcoin2-master/src/obj -DUSE_UPNP=1 -DENABLE_WALLET -I/navcoin2-master/src/secp256k1/include -I/navcoin2-master/src/leveldb/include -I/navcoin2-master/src/leveldb/helpers -DHAVE_BUILD_INFO -fno-stack-protector -fstack-protector-all -Wstack-protector -D_FORTIFY_SOURCE=2  -MMD -MF obj/keystore.d -o obj/keystore.o keystore.cpp
g++ -c -O2  -pthread -Wall -Wextra -Wno-ignored-qualifiers -Wformat -Wformat-security -Wno-unused-parameter -Wunused-function -Wunused-variable -fpermissive -Wconversion-null -g -DBOOST_SPIRIT_THREADSAFE -I/navcoin2-master/src -I/navcoin2-master/src/obj -DUSE_UPNP=1 -DENABLE_WALLET -I/navcoin2-master/src/secp256k1/include -I/navcoin2-master/src/leveldb/include -I/navcoin2-master/src/leveldb/helpers -DHAVE_BUILD_INFO -fno-stack-protector -fstack-protector-all -Wstack-protector -D_FORTIFY_SOURCE=2  -MMD -MF obj/core.d -o obj/core.o core.cpp
g++ -c -O2  -pthread -Wall -Wextra -Wno-ignored-qualifiers -Wformat -Wformat-security -Wno-unused-parameter -Wunused-function -Wunused-variable -fpermissive -Wconversion-null -g -DBOOST_SPIRIT_THREADSAFE -I/navcoin2-master/src -I/navcoin2-master/src/obj -DUSE_UPNP=1 -DENABLE_WALLET -I/navcoin2-master/src/secp256k1/include -I/navcoin2-master/src/leveldb/include -I/navcoin2-master/src/leveldb/helpers -DHAVE_BUILD_INFO -fno-stack-protector -fstack-protector-all -Wstack-protector -D_FORTIFY_SOURCE=2  -MMD -MF obj/main.d -o obj/main.o main.cpp
g++ -c -O2  -pthread -Wall -Wextra -Wno-ignored-qualifiers -Wformat -Wformat-security -Wno-unused-parameter -Wunused-function -Wunused-variable -fpermissive -Wconversion-null -g -DBOOST_SPIRIT_THREADSAFE -I/navcoin2-master/src -I/navcoin2-master/src/obj -DUSE_UPNP=1 -DENABLE_WALLET -I/navcoin2-master/src/secp256k1/include -I/navcoin2-master/src/leveldb/include -I/navcoin2-master/src/leveldb/helpers -DHAVE_BUILD_INFO -fno-stack-protector -fstack-protector-all -Wstack-protector -D_FORTIFY_SOURCE=2  -MMD -MF obj/net.d -o obj/net.o net.cpp
net.cpp:1099:20: warning: ‘strDNSSeed’ defined but not used [-Wunused-variable]
 static const char *strDNSSeed[][2] = {
                    ^
g++ -c -O2  -pthread -Wall -Wextra -Wno-ignored-qualifiers -Wformat -Wformat-security -Wno-unused-parameter -Wunused-function -Wunused-variable -fpermissive -Wconversion-null -g -DBOOST_SPIRIT_THREADSAFE -I/navcoin2-master/src -I/navcoin2-master/src/obj -DUSE_UPNP=1 -DENABLE_WALLET -I/navcoin2-master/src/secp256k1/include -I/navcoin2-master/src/leveldb/include -I/navcoin2-master/src/leveldb/helpers -DHAVE_BUILD_INFO -fno-stack-protector -fstack-protector-all -Wstack-protector -D_FORTIFY_SOURCE=2  -MMD -MF obj/protocol.d -o obj/protocol.o protocol.cpp
g++ -c -O2  -pthread -Wall -Wextra -Wno-ignored-qualifiers -Wformat -Wformat-security -Wno-unused-parameter -Wunused-function -Wunused-variable -fpermissive -Wconversion-null -g -DBOOST_SPIRIT_THREADSAFE -I/navcoin2-master/src -I/navcoin2-master/src/obj -DUSE_UPNP=1 -DENABLE_WALLET -I/navcoin2-master/src/secp256k1/include -I/navcoin2-master/src/leveldb/include -I/navcoin2-master/src/leveldb/helpers -DHAVE_BUILD_INFO -fno-stack-protector -fstack-protector-all -Wstack-protector -D_FORTIFY_SOURCE=2  -MMD -MF obj/rpcclient.d -o obj/rpcclient.o rpcclient.cpp
g++ -c -O2  -pthread -Wall -Wextra -Wno-ignored-qualifiers -Wformat -Wformat-security -Wno-unused-parameter -Wunused-function -Wunused-variable -fpermissive -Wconversion-null -g -DBOOST_SPIRIT_THREADSAFE -I/navcoin2-master/src -I/navcoin2-master/src/obj -DUSE_UPNP=1 -DENABLE_WALLET -I/navcoin2-master/src/secp256k1/include -I/navcoin2-master/src/leveldb/include -I/navcoin2-master/src/leveldb/helpers -DHAVE_BUILD_INFO -fno-stack-protector -fstack-protector-all -Wstack-protector -D_FORTIFY_SOURCE=2  -MMD -MF obj/rpcprotocol.d -o obj/rpcprotocol.o rpcprotocol.cpp
g++ -c -O2  -pthread -Wall -Wextra -Wno-ignored-qualifiers -Wformat -Wformat-security -Wno-unused-parameter -Wunused-function -Wunused-variable -fpermissive -Wconversion-null -g -DBOOST_SPIRIT_THREADSAFE -I/navcoin2-master/src -I/navcoin2-master/src/obj -DUSE_UPNP=1 -DENABLE_WALLET -I/navcoin2-master/src/secp256k1/include -I/navcoin2-master/src/leveldb/include -I/navcoin2-master/src/leveldb/helpers -DHAVE_BUILD_INFO -fno-stack-protector -fstack-protector-all -Wstack-protector -D_FORTIFY_SOURCE=2  -MMD -MF obj/rpcserver.d -o obj/rpcserver.o rpcserver.cpp
rpcserver.cpp:324:1: warning: missing initializer for member ‘CRPCCommand::reqWallet’ [-Wmissing-field-initializers]
 };
 ^
g++ -c -O2  -pthread -Wall -Wextra -Wno-ignored-qualifiers -Wformat -Wformat-security -Wno-unused-parameter -Wunused-function -Wunused-variable -fpermissive -Wconversion-null -g -DBOOST_SPIRIT_THREADSAFE -I/navcoin2-master/src -I/navcoin2-master/src/obj -DUSE_UPNP=1 -DENABLE_WALLET -I/navcoin2-master/src/secp256k1/include -I/navcoin2-master/src/leveldb/include -I/navcoin2-master/src/leveldb/helpers -DHAVE_BUILD_INFO -fno-stack-protector -fstack-protector-all -Wstack-protector -D_FORTIFY_SOURCE=2  -MMD -MF obj/rpcmisc.d -o obj/rpcmisc.o rpcmisc.cpp
g++ -c -O2  -pthread -Wall -Wextra -Wno-ignored-qualifiers -Wformat -Wformat-security -Wno-unused-parameter -Wunused-function -Wunused-variable -fpermissive -Wconversion-null -g -DBOOST_SPIRIT_THREADSAFE -I/navcoin2-master/src -I/navcoin2-master/src/obj -DUSE_UPNP=1 -DENABLE_WALLET -I/navcoin2-master/src/secp256k1/include -I/navcoin2-master/src/leveldb/include -I/navcoin2-master/src/leveldb/helpers -DHAVE_BUILD_INFO -fno-stack-protector -fstack-protector-all -Wstack-protector -D_FORTIFY_SOURCE=2  -MMD -MF obj/rpcnet.d -o obj/rpcnet.o rpcnet.cpp
g++ -c -O2  -pthread -Wall -Wextra -Wno-ignored-qualifiers -Wformat -Wformat-security -Wno-unused-parameter -Wunused-function -Wunused-variable -fpermissive -Wconversion-null -g -DBOOST_SPIRIT_THREADSAFE -I/navcoin2-master/src -I/navcoin2-master/src/obj -DUSE_UPNP=1 -DENABLE_WALLET -I/navcoin2-master/src/secp256k1/include -I/navcoin2-master/src/leveldb/include -I/navcoin2-master/src/leveldb/helpers -DHAVE_BUILD_INFO -fno-stack-protector -fstack-protector-all -Wstack-protector -D_FORTIFY_SOURCE=2  -MMD -MF obj/rpcblockchain.d -o obj/rpcblockchain.o rpcblockchain.cpp
g++ -c -O2  -pthread -Wall -Wextra -Wno-ignored-qualifiers -Wformat -Wformat-security -Wno-unused-parameter -Wunused-function -Wunused-variable -fpermissive -Wconversion-null -g -DBOOST_SPIRIT_THREADSAFE -I/navcoin2-master/src -I/navcoin2-master/src/obj -DUSE_UPNP=1 -DENABLE_WALLET -I/navcoin2-master/src/secp256k1/include -I/navcoin2-master/src/leveldb/include -I/navcoin2-master/src/leveldb/helpers -DHAVE_BUILD_INFO -fno-stack-protector -fstack-protector-all -Wstack-protector -D_FORTIFY_SOURCE=2  -MMD -MF obj/rpcrawtransaction.d -o obj/rpcrawtransaction.o rpcrawtransaction.cpp
In file included from /usr/include/boost/iterator/iterator_categories.hpp:22:0,
                 from /usr/include/boost/iterator/iterator_facade.hpp:14,
                 from /usr/include/boost/range/iterator_range_core.hpp:27,
                 from /usr/include/boost/range/iterator_range.hpp:13,
                 from /usr/include/boost/assign/list_of.hpp:20,
                 from rpcrawtransaction.cpp:6:
/usr/include/boost/variant/get.hpp: In instantiation of ‘typename boost::add_reference<T>::type boost::strict_get(boost::variant<T0, T1, T2, T3, T4, T5, T6, T7, T8, T9, T10, T11, T12, T13, T14, T15, T16, T17, T18, T19>&) [with U = const CScriptID&; T0 = CNoDestination; T1 = CKeyID; T2 = CScriptID; T3 = CSecretAddress; T4 = boost::detail::variant::void_; T5 = boost::detail::variant::void_; T6 = boost::detail::variant::void_; T7 = boost::detail::variant::void_; T8 = boost::detail::variant::void_; T9 = boost::detail::variant::void_; T10 = boost::detail::variant::void_; T11 = boost::detail::variant::void_; T12 = boost::detail::variant::void_; T13 = boost::detail::variant::void_; T14 = boost::detail::variant::void_; T15 = boost::detail::variant::void_; T16 = boost::detail::variant::void_; T17 = boost::detail::variant::void_; T18 = boost::detail::variant::void_; T19 = boost::detail::variant::void_; typename boost::add_reference<T>::type = const CScriptID&]’:
/usr/include/boost/variant/get.hpp:284:25:   required from ‘typename boost::add_reference<T>::type boost::get(boost::variant<T0, T1, T2, T3, T4, T5, T6, T7, T8, T9, T10, T11, T12, T13, T14, T15, T16, T17, T18, T19>&) [with U = const CScriptID&; T0 = CNoDestination; T1 = CKeyID; T2 = CScriptID; T3 = CSecretAddress; T4 = boost::detail::variant::void_; T5 = boost::detail::variant::void_; T6 = boost::detail::variant::void_; T7 = boost::detail::variant::void_; T8 = boost::detail::variant::void_; T9 = boost::detail::variant::void_; T10 = boost::detail::variant::void_; T11 = boost::detail::variant::void_; T12 = boost::detail::variant::void_; T13 = boost::detail::variant::void_; T14 = boost::detail::variant::void_; T15 = boost::detail::variant::void_; T16 = boost::detail::variant::void_; T17 = boost::detail::variant::void_; T18 = boost::detail::variant::void_; T19 = boost::detail::variant::void_; typename boost::add_reference<T>::type = const CScriptID&]’
rpcrawtransaction.cpp:221:77:   required from here
/usr/include/boost/variant/get.hpp:178:5: error: invalid application of ‘sizeof’ to incomplete type ‘boost::STATIC_ASSERTION_FAILURE<false>’
     BOOST_STATIC_ASSERT_MSG(
     ^
makefile.unix:221: recipe for target 'obj/rpcrawtransaction.o' failed
make: *** [obj/rpcrawtransaction.o] Error 1
node@node-VirtualBox /navcoin2-master/src $
shahim
Legendary
*
Offline Offline

Activity: 1082
Merit: 1002


View Profile
September 13, 2016, 12:24:12 PM
 #19228

Hi,

please check, if the folder "obj" exsists inside the "src" folder. If not, create it and rerun the make -f makefile.unix USE_UPNP=1


regards
shahim

ps:

Here is a small "script" I use for updating the servers. Perhaps you need first to make an "apt-get install git" , if git is not avaiable. These steps are tested like 100 times from myself updating and installing servers... Perhaps change folders to your user folders!

cd /root/
rm -rf /root/navcoin2
git clone https://github.com/navcoindev/navcoin2
cd navcoin2/src/secp256k1/
./autogen.sh
./configure --enable-module-recovery
make
cd /root/navcoin2/src/
rm -rf obj
mkdir obj
chmod 777 leveldb/build_detect_platform
make -f makefile.unix USE_UPNP=1
strip navcoind


hashforce101
Legendary
*
Offline Offline

Activity: 1022
Merit: 1000


View Profile
September 13, 2016, 12:56:32 PM
 #19229

Poloniex is the place to be. Great tech support and great trading.

NAV /Fiat is a awesome dream that we need to aim for with solid planning.

Exchanges adding NAV without going through the NAV Foundation causes issues. We have experienced this before. Just from experience with exchanges appearing then causing issues.

Anyway very important week with Anon testing and major release.
DragonBall Fan
Newbie
*
Offline Offline

Activity: 31
Merit: 0


View Profile
September 13, 2016, 01:31:29 PM
 #19230

Hi,

please check, if the folder "obj" exsists inside the "src" folder. If not, create it and rerun the make -f makefile.unix USE_UPNP=1
Hi, yes the folder "obj" was exists.

Here is a small "script" I use for updating the servers. Perhaps you need first to make an "apt-get install git" , if git is not avaiable. These steps are tested like 100 times from myself updating and installing servers... Perhaps change folders to your user folders!

cd /root/
rm -rf /root/navcoin2
git clone https://github.com/navcoindev/navcoin2
cd navcoin2/src/secp256k1/
./autogen.sh
./configure --enable-module-recovery
make
cd /root/navcoin2/src/
rm -rf obj
mkdir obj
chmod 777 leveldb/build_detect_platform
make -f makefile.unix USE_UPNP=1
strip navcoind

Doesnt work :/

Code:
node-VirtualBox / # cd /root/
node-VirtualBox ~ # rm -rf /root/navcoin2
node-VirtualBox ~ # git clone https://github.com/navcoindev/navcoin2
Cloning into 'navcoin2'...
remote: Counting objects: 1550, done.
remote: Compressing objects: 100% (56/56), done.
remote: Total 1550 (delta 29), reused 0 (delta 0), pack-reused 1494
Receiving objects: 100% (1550/1550), 77.02 MiB | 95.00 KiB/s, done.
Resolving deltas: 100% (382/382), done.
Checking connectivity... done.
node-VirtualBox ~ # cd navcoin2/src/secp256k1/
node-VirtualBox secp256k1 # ./autogen.sh
libtoolize: putting auxiliary files in AC_CONFIG_AUX_DIR, 'build-aux'.
libtoolize: copying file 'build-aux/ltmain.sh'
libtoolize: putting macros in AC_CONFIG_MACRO_DIRS, 'build-aux/m4'.
libtoolize: copying file 'build-aux/m4/libtool.m4'
libtoolize: copying file 'build-aux/m4/ltoptions.m4'
libtoolize: copying file 'build-aux/m4/ltsugar.m4'
libtoolize: copying file 'build-aux/m4/ltversion.m4'
libtoolize: copying file 'build-aux/m4/lt~obsolete.m4'
configure.ac:10: installing 'build-aux/compile'
configure.ac:9: installing 'build-aux/missing'
Makefile.am: installing 'build-aux/depcomp'
node-VirtualBox secp256k1 # ./configure --enable-module-recovery
checking build system type... x86_64-pc-linux-gnu
checking host system type... x86_64-pc-linux-gnu
checking for a BSD-compatible install... /usr/bin/install -c
checking whether build environment is sane... yes
checking for a thread-safe mkdir -p... /bin/mkdir -p
checking for gawk... gawk
checking whether make sets $(MAKE)... yes
checking whether make supports nested variables... yes
checking how to print strings... printf
checking for style of include used by make... GNU
checking for gcc... gcc
checking whether the C compiler works... yes
checking for C compiler default output file name... a.out
checking for suffix of executables...
checking whether we are cross compiling... no
checking for suffix of object files... o
checking whether we are using the GNU C compiler... yes
checking whether gcc accepts -g... yes
checking for gcc option to accept ISO C89... none needed
checking whether gcc understands -c and -o together... yes
checking dependency style of gcc... gcc3
checking for a sed that does not truncate output... /bin/sed
checking for grep that handles long lines and -e... /bin/grep
checking for egrep... /bin/grep -E
checking for fgrep... /bin/grep -F
checking for ld used by gcc... /usr/bin/ld
checking if the linker (/usr/bin/ld) is GNU ld... yes
checking for BSD- or MS-compatible name lister (nm)... /usr/bin/nm -B
checking the name lister (/usr/bin/nm -B) interface... BSD nm
checking whether ln -s works... yes
checking the maximum length of command line arguments... 1572864
checking how to convert x86_64-pc-linux-gnu file names to x86_64-pc-linux-gnu format... func_convert_file_noop
checking how to convert x86_64-pc-linux-gnu file names to toolchain format... func_convert_file_noop
checking for /usr/bin/ld option to reload object files... -r
checking for objdump... objdump
checking how to recognize dependent libraries... pass_all
checking for dlltool... no
checking how to associate runtime and link libraries... printf %s\n
checking for ar... ar
checking for archiver @FILE support... @
checking for strip... strip
checking for ranlib... ranlib
checking command to parse /usr/bin/nm -B output from gcc object... ok
checking for sysroot... no
checking for a working dd... /bin/dd
checking how to truncate binary pipes... /bin/dd bs=4096 count=1
checking for mt... mt
checking if mt is a manifest tool... no
checking how to run the C preprocessor... gcc -E
checking for ANSI C header files... yes
checking for sys/types.h... yes
checking for sys/stat.h... yes
checking for stdlib.h... yes
checking for string.h... yes
checking for memory.h... yes
checking for strings.h... yes
checking for inttypes.h... yes
checking for stdint.h... yes
checking for unistd.h... yes
checking for dlfcn.h... yes
checking for objdir... .libs
checking if gcc supports -fno-rtti -fno-exceptions... no
checking for gcc option to produce PIC... -fPIC -DPIC
checking if gcc PIC flag -fPIC -DPIC works... yes
checking if gcc static flag -static works... yes
checking if gcc supports -c -o file.o... yes
checking if gcc supports -c -o file.o... (cached) yes
checking whether the gcc linker (/usr/bin/ld -m elf_x86_64) supports shared libraries... yes
checking whether -lc should be explicitly linked in... no
checking dynamic linker characteristics... GNU/Linux ld.so
checking how to hardcode library paths into programs... immediate
checking whether stripping libraries is possible... yes
checking if libtool supports shared libraries... yes
checking whether to build shared libraries... yes
checking whether to build static libraries... yes
checking whether make supports nested variables... (cached) yes
checking for pkg-config... /usr/bin/pkg-config
checking pkg-config is at least version 0.9.0... yes
checking for ar... /usr/bin/ar
checking for ranlib... /usr/bin/ranlib
checking for strip... /usr/bin/strip
checking for gcc... gcc
checking whether we are using the GNU C compiler... (cached) yes
checking whether gcc accepts -g... yes
checking for gcc option to accept ISO C89... (cached) none needed
checking whether gcc understands -c and -o together... (cached) yes
checking dependency style of gcc... (cached) gcc3
checking how to run the C preprocessor... gcc -E
checking for gcc option to accept ISO C89... (cached) none needed
checking if gcc supports -std=c89 -pedantic -Wall -Wextra -Wcast-align -Wnested-externs -Wshadow -Wstrict-prototypes -Wno-unused-function -Wno-long-long -Wno-overlength-strings... yes
checking if gcc supports -fvisibility=hidden... yes
checking for __int128... yes
checking for __builtin_expect... yes
checking for x86_64 assembly availability... yes
checking gmp.h usability... yes
checking gmp.h presence... yes
checking for gmp.h... yes
checking for __gmpz_init in -lgmp... yes
checking for CRYPTO... yes
checking for main in -lcrypto... yes
checking for EC functions in libcrypto... yes
checking whether byte ordering is bigendian... no
configure: Using assembly optimizations: x86_64
configure: Using field implementation: 64bit
configure: Using bignum implementation: gmp
configure: Using scalar implementation: 64bit
configure: Using endomorphism optimizations: no
configure: Building ECDSA pubkey recovery module: yes
checking that generated files are newer than configure... done
configure: creating ./config.status
config.status: creating Makefile
config.status: creating libsecp256k1.pc
config.status: creating src/libsecp256k1-config.h
config.status: executing depfiles commands
config.status: executing libtool commands
node-VirtualBox secp256k1 # make
gcc -I. -g -O2 -Wall -Wextra -Wno-unused-function -c src/gen_context.c -o gen_context.o
gcc gen_context.o -o gen_context
./gen_context
  CC       src/libsecp256k1_la-secp256k1.lo
  CCLD     libsecp256k1.la
/usr/bin/ar: `u' modifier ignored since `D' is the default (see `U')
  CC       src/tests-tests.o
  CCLD     tests
node-VirtualBox secp256k1 # cd /root/navcoin2/src/
node-VirtualBox src # rm -rf obj
node-VirtualBox src # mkdir obj
node-VirtualBox src # chmod 777 leveldb/build_detect_platform
node-VirtualBox src # make -f makefile.unix USE_UPNP=1
g++ -c -O2  -pthread -Wall -Wextra -Wno-ignored-qualifiers -Wformat -Wformat-security -Wno-unused-parameter -Wunused-function -Wunused-variable -fpermissive -Wconversion-null -g -DBOOST_SPIRIT_THREADSAFE -I/root/navcoin2/src -I/root/navcoin2/src/obj -DUSE_UPNP=1 -DENABLE_WALLET -I/root/navcoin2/src/secp256k1/include -I/root/navcoin2/src/leveldb/include -I/root/navcoin2/src/leveldb/helpers -DHAVE_BUILD_INFO -fno-stack-protector -fstack-protector-all -Wstack-protector -D_FORTIFY_SOURCE=2  -MMD -MF obj/alert.d -o obj/alert.o alert.cpp
/bin/sh ../share/genbuild.sh obj/build.h
g++ -c -O2  -pthread -Wall -Wextra -Wno-ignored-qualifiers -Wformat -Wformat-security -Wno-unused-parameter -Wunused-function -Wunused-variable -fpermissive -Wconversion-null -g -DBOOST_SPIRIT_THREADSAFE -I/root/navcoin2/src -I/root/navcoin2/src/obj -DUSE_UPNP=1 -DENABLE_WALLET -I/root/navcoin2/src/secp256k1/include -I/root/navcoin2/src/leveldb/include -I/root/navcoin2/src/leveldb/helpers -DHAVE_BUILD_INFO -fno-stack-protector -fstack-protector-all -Wstack-protector -D_FORTIFY_SOURCE=2  -MMD -MF obj/version.d -o obj/version.o version.cpp
g++ -c -O2  -pthread -Wall -Wextra -Wno-ignored-qualifiers -Wformat -Wformat-security -Wno-unused-parameter -Wunused-function -Wunused-variable -fpermissive -Wconversion-null -g -DBOOST_SPIRIT_THREADSAFE -I/root/navcoin2/src -I/root/navcoin2/src/obj -DUSE_UPNP=1 -DENABLE_WALLET -I/root/navcoin2/src/secp256k1/include -I/root/navcoin2/src/leveldb/include -I/root/navcoin2/src/leveldb/helpers -DHAVE_BUILD_INFO -fno-stack-protector -fstack-protector-all -Wstack-protector -D_FORTIFY_SOURCE=2  -MMD -MF obj/checkpoints.d -o obj/checkpoints.o checkpoints.cpp
g++ -c -O2  -pthread -Wall -Wextra -Wno-ignored-qualifiers -Wformat -Wformat-security -Wno-unused-parameter -Wunused-function -Wunused-variable -fpermissive -Wconversion-null -g -DBOOST_SPIRIT_THREADSAFE -I/root/navcoin2/src -I/root/navcoin2/src/obj -DUSE_UPNP=1 -DENABLE_WALLET -I/root/navcoin2/src/secp256k1/include -I/root/navcoin2/src/leveldb/include -I/root/navcoin2/src/leveldb/helpers -DHAVE_BUILD_INFO -fno-stack-protector -fstack-protector-all -Wstack-protector -D_FORTIFY_SOURCE=2  -MMD -MF obj/netbase.d -o obj/netbase.o netbase.cpp
g++ -c -O2  -pthread -Wall -Wextra -Wno-ignored-qualifiers -Wformat -Wformat-security -Wno-unused-parameter -Wunused-function -Wunused-variable -fpermissive -Wconversion-null -g -DBOOST_SPIRIT_THREADSAFE -I/root/navcoin2/src -I/root/navcoin2/src/obj -DUSE_UPNP=1 -DENABLE_WALLET -I/root/navcoin2/src/secp256k1/include -I/root/navcoin2/src/leveldb/include -I/root/navcoin2/src/leveldb/helpers -DHAVE_BUILD_INFO -fno-stack-protector -fstack-protector-all -Wstack-protector -D_FORTIFY_SOURCE=2  -MMD -MF obj/addrman.d -o obj/addrman.o addrman.cpp
g++ -c -O2  -pthread -Wall -Wextra -Wno-ignored-qualifiers -Wformat -Wformat-security -Wno-unused-parameter -Wunused-function -Wunused-variable -fpermissive -Wconversion-null -g -DBOOST_SPIRIT_THREADSAFE -I/root/navcoin2/src -I/root/navcoin2/src/obj -DUSE_UPNP=1 -DENABLE_WALLET -I/root/navcoin2/src/secp256k1/include -I/root/navcoin2/src/leveldb/include -I/root/navcoin2/src/leveldb/helpers -DHAVE_BUILD_INFO -fno-stack-protector -fstack-protector-all -Wstack-protector -D_FORTIFY_SOURCE=2  -MMD -MF obj/crypter.d -o obj/crypter.o crypter.cpp
g++ -c -O2  -pthread -Wall -Wextra -Wno-ignored-qualifiers -Wformat -Wformat-security -Wno-unused-parameter -Wunused-function -Wunused-variable -fpermissive -Wconversion-null -g -DBOOST_SPIRIT_THREADSAFE -I/root/navcoin2/src -I/root/navcoin2/src/obj -DUSE_UPNP=1 -DENABLE_WALLET -I/root/navcoin2/src/secp256k1/include -I/root/navcoin2/src/leveldb/include -I/root/navcoin2/src/leveldb/helpers -DHAVE_BUILD_INFO -fno-stack-protector -fstack-protector-all -Wstack-protector -D_FORTIFY_SOURCE=2  -MMD -MF obj/key.d -o obj/key.o key.cpp
key.cpp: In member function ‘bool CPubKey::VerifyCompact(const uint256&, const std::vector<unsigned char>&) const’:
key.cpp:632:10: warning: unused variable ‘fComp’ [-Wunused-variable]
     bool fComp = IsCompressed();
          ^
g++ -c -O2  -pthread -Wall -Wextra -Wno-ignored-qualifiers -Wformat -Wformat-security -Wno-unused-parameter -Wunused-function -Wunused-variable -fpermissive -Wconversion-null -g -DBOOST_SPIRIT_THREADSAFE -I/root/navcoin2/src -I/root/navcoin2/src/obj -DUSE_UPNP=1 -DENABLE_WALLET -I/root/navcoin2/src/secp256k1/include -I/root/navcoin2/src/leveldb/include -I/root/navcoin2/src/leveldb/helpers -DHAVE_BUILD_INFO -fno-stack-protector -fstack-protector-all -Wstack-protector -D_FORTIFY_SOURCE=2  -MMD -MF obj/eckey.d -o obj/eckey.o eckey.cpp
g++ -c -O2  -pthread -Wall -Wextra -Wno-ignored-qualifiers -Wformat -Wformat-security -Wno-unused-parameter -Wunused-function -Wunused-variable -fpermissive -Wconversion-null -g -DBOOST_SPIRIT_THREADSAFE -I/root/navcoin2/src -I/root/navcoin2/src/obj -DUSE_UPNP=1 -DENABLE_WALLET -I/root/navcoin2/src/secp256k1/include -I/root/navcoin2/src/leveldb/include -I/root/navcoin2/src/leveldb/helpers -DHAVE_BUILD_INFO -fno-stack-protector -fstack-protector-all -Wstack-protector -D_FORTIFY_SOURCE=2  -MMD -MF obj/init.d -o obj/init.o init.cpp
g++ -c -O2  -pthread -Wall -Wextra -Wno-ignored-qualifiers -Wformat -Wformat-security -Wno-unused-parameter -Wunused-function -Wunused-variable -fpermissive -Wconversion-null -g -DBOOST_SPIRIT_THREADSAFE -I/root/navcoin2/src -I/root/navcoin2/src/obj -DUSE_UPNP=1 -DENABLE_WALLET -I/root/navcoin2/src/secp256k1/include -I/root/navcoin2/src/leveldb/include -I/root/navcoin2/src/leveldb/helpers -DHAVE_BUILD_INFO -fno-stack-protector -fstack-protector-all -Wstack-protector -D_FORTIFY_SOURCE=2  -MMD -MF obj/bitcoind.d -o obj/bitcoind.o bitcoind.cpp
g++ -c -O2  -pthread -Wall -Wextra -Wno-ignored-qualifiers -Wformat -Wformat-security -Wno-unused-parameter -Wunused-function -Wunused-variable -fpermissive -Wconversion-null -g -DBOOST_SPIRIT_THREADSAFE -I/root/navcoin2/src -I/root/navcoin2/src/obj -DUSE_UPNP=1 -DENABLE_WALLET -I/root/navcoin2/src/secp256k1/include -I/root/navcoin2/src/leveldb/include -I/root/navcoin2/src/leveldb/helpers -DHAVE_BUILD_INFO -fno-stack-protector -fstack-protector-all -Wstack-protector -D_FORTIFY_SOURCE=2  -MMD -MF obj/keystore.d -o obj/keystore.o keystore.cpp
g++ -c -O2  -pthread -Wall -Wextra -Wno-ignored-qualifiers -Wformat -Wformat-security -Wno-unused-parameter -Wunused-function -Wunused-variable -fpermissive -Wconversion-null -g -DBOOST_SPIRIT_THREADSAFE -I/root/navcoin2/src -I/root/navcoin2/src/obj -DUSE_UPNP=1 -DENABLE_WALLET -I/root/navcoin2/src/secp256k1/include -I/root/navcoin2/src/leveldb/include -I/root/navcoin2/src/leveldb/helpers -DHAVE_BUILD_INFO -fno-stack-protector -fstack-protector-all -Wstack-protector -D_FORTIFY_SOURCE=2  -MMD -MF obj/core.d -o obj/core.o core.cpp
g++ -c -O2  -pthread -Wall -Wextra -Wno-ignored-qualifiers -Wformat -Wformat-security -Wno-unused-parameter -Wunused-function -Wunused-variable -fpermissive -Wconversion-null -g -DBOOST_SPIRIT_THREADSAFE -I/root/navcoin2/src -I/root/navcoin2/src/obj -DUSE_UPNP=1 -DENABLE_WALLET -I/root/navcoin2/src/secp256k1/include -I/root/navcoin2/src/leveldb/include -I/root/navcoin2/src/leveldb/helpers -DHAVE_BUILD_INFO -fno-stack-protector -fstack-protector-all -Wstack-protector -D_FORTIFY_SOURCE=2  -MMD -MF obj/main.d -o obj/main.o main.cpp
g++ -c -O2  -pthread -Wall -Wextra -Wno-ignored-qualifiers -Wformat -Wformat-security -Wno-unused-parameter -Wunused-function -Wunused-variable -fpermissive -Wconversion-null -g -DBOOST_SPIRIT_THREADSAFE -I/root/navcoin2/src -I/root/navcoin2/src/obj -DUSE_UPNP=1 -DENABLE_WALLET -I/root/navcoin2/src/secp256k1/include -I/root/navcoin2/src/leveldb/include -I/root/navcoin2/src/leveldb/helpers -DHAVE_BUILD_INFO -fno-stack-protector -fstack-protector-all -Wstack-protector -D_FORTIFY_SOURCE=2  -MMD -MF obj/net.d -o obj/net.o net.cpp
net.cpp:1099:20: warning: ‘strDNSSeed’ defined but not used [-Wunused-variable]
 static const char *strDNSSeed[][2] = {
                    ^
g++ -c -O2  -pthread -Wall -Wextra -Wno-ignored-qualifiers -Wformat -Wformat-security -Wno-unused-parameter -Wunused-function -Wunused-variable -fpermissive -Wconversion-null -g -DBOOST_SPIRIT_THREADSAFE -I/root/navcoin2/src -I/root/navcoin2/src/obj -DUSE_UPNP=1 -DENABLE_WALLET -I/root/navcoin2/src/secp256k1/include -I/root/navcoin2/src/leveldb/include -I/root/navcoin2/src/leveldb/helpers -DHAVE_BUILD_INFO -fno-stack-protector -fstack-protector-all -Wstack-protector -D_FORTIFY_SOURCE=2  -MMD -MF obj/protocol.d -o obj/protocol.o protocol.cpp
g++ -c -O2  -pthread -Wall -Wextra -Wno-ignored-qualifiers -Wformat -Wformat-security -Wno-unused-parameter -Wunused-function -Wunused-variable -fpermissive -Wconversion-null -g -DBOOST_SPIRIT_THREADSAFE -I/root/navcoin2/src -I/root/navcoin2/src/obj -DUSE_UPNP=1 -DENABLE_WALLET -I/root/navcoin2/src/secp256k1/include -I/root/navcoin2/src/leveldb/include -I/root/navcoin2/src/leveldb/helpers -DHAVE_BUILD_INFO -fno-stack-protector -fstack-protector-all -Wstack-protector -D_FORTIFY_SOURCE=2  -MMD -MF obj/rpcclient.d -o obj/rpcclient.o rpcclient.cpp
g++ -c -O2  -pthread -Wall -Wextra -Wno-ignored-qualifiers -Wformat -Wformat-security -Wno-unused-parameter -Wunused-function -Wunused-variable -fpermissive -Wconversion-null -g -DBOOST_SPIRIT_THREADSAFE -I/root/navcoin2/src -I/root/navcoin2/src/obj -DUSE_UPNP=1 -DENABLE_WALLET -I/root/navcoin2/src/secp256k1/include -I/root/navcoin2/src/leveldb/include -I/root/navcoin2/src/leveldb/helpers -DHAVE_BUILD_INFO -fno-stack-protector -fstack-protector-all -Wstack-protector -D_FORTIFY_SOURCE=2  -MMD -MF obj/rpcprotocol.d -o obj/rpcprotocol.o rpcprotocol.cpp
g++ -c -O2  -pthread -Wall -Wextra -Wno-ignored-qualifiers -Wformat -Wformat-security -Wno-unused-parameter -Wunused-function -Wunused-variable -fpermissive -Wconversion-null -g -DBOOST_SPIRIT_THREADSAFE -I/root/navcoin2/src -I/root/navcoin2/src/obj -DUSE_UPNP=1 -DENABLE_WALLET -I/root/navcoin2/src/secp256k1/include -I/root/navcoin2/src/leveldb/include -I/root/navcoin2/src/leveldb/helpers -DHAVE_BUILD_INFO -fno-stack-protector -fstack-protector-all -Wstack-protector -D_FORTIFY_SOURCE=2  -MMD -MF obj/rpcserver.d -o obj/rpcserver.o rpcserver.cpp
rpcserver.cpp:324:1: warning: missing initializer for member ‘CRPCCommand::reqWallet’ [-Wmissing-field-initializers]
 };
 ^
g++ -c -O2  -pthread -Wall -Wextra -Wno-ignored-qualifiers -Wformat -Wformat-security -Wno-unused-parameter -Wunused-function -Wunused-variable -fpermissive -Wconversion-null -g -DBOOST_SPIRIT_THREADSAFE -I/root/navcoin2/src -I/root/navcoin2/src/obj -DUSE_UPNP=1 -DENABLE_WALLET -I/root/navcoin2/src/secp256k1/include -I/root/navcoin2/src/leveldb/include -I/root/navcoin2/src/leveldb/helpers -DHAVE_BUILD_INFO -fno-stack-protector -fstack-protector-all -Wstack-protector -D_FORTIFY_SOURCE=2  -MMD -MF obj/rpcmisc.d -o obj/rpcmisc.o rpcmisc.cpp
g++ -c -O2  -pthread -Wall -Wextra -Wno-ignored-qualifiers -Wformat -Wformat-security -Wno-unused-parameter -Wunused-function -Wunused-variable -fpermissive -Wconversion-null -g -DBOOST_SPIRIT_THREADSAFE -I/root/navcoin2/src -I/root/navcoin2/src/obj -DUSE_UPNP=1 -DENABLE_WALLET -I/root/navcoin2/src/secp256k1/include -I/root/navcoin2/src/leveldb/include -I/root/navcoin2/src/leveldb/helpers -DHAVE_BUILD_INFO -fno-stack-protector -fstack-protector-all -Wstack-protector -D_FORTIFY_SOURCE=2  -MMD -MF obj/rpcnet.d -o obj/rpcnet.o rpcnet.cpp
g++ -c -O2  -pthread -Wall -Wextra -Wno-ignored-qualifiers -Wformat -Wformat-security -Wno-unused-parameter -Wunused-function -Wunused-variable -fpermissive -Wconversion-null -g -DBOOST_SPIRIT_THREADSAFE -I/root/navcoin2/src -I/root/navcoin2/src/obj -DUSE_UPNP=1 -DENABLE_WALLET -I/root/navcoin2/src/secp256k1/include -I/root/navcoin2/src/leveldb/include -I/root/navcoin2/src/leveldb/helpers -DHAVE_BUILD_INFO -fno-stack-protector -fstack-protector-all -Wstack-protector -D_FORTIFY_SOURCE=2  -MMD -MF obj/rpcblockchain.d -o obj/rpcblockchain.o rpcblockchain.cpp
g++ -c -O2  -pthread -Wall -Wextra -Wno-ignored-qualifiers -Wformat -Wformat-security -Wno-unused-parameter -Wunused-function -Wunused-variable -fpermissive -Wconversion-null -g -DBOOST_SPIRIT_THREADSAFE -I/root/navcoin2/src -I/root/navcoin2/src/obj -DUSE_UPNP=1 -DENABLE_WALLET -I/root/navcoin2/src/secp256k1/include -I/root/navcoin2/src/leveldb/include -I/root/navcoin2/src/leveldb/helpers -DHAVE_BUILD_INFO -fno-stack-protector -fstack-protector-all -Wstack-protector -D_FORTIFY_SOURCE=2  -MMD -MF obj/rpcrawtransaction.d -o obj/rpcrawtransaction.o rpcrawtransaction.cpp
In file included from /usr/include/boost/iterator/iterator_categories.hpp:22:0,
                 from /usr/include/boost/iterator/iterator_facade.hpp:14,
                 from /usr/include/boost/range/iterator_range_core.hpp:27,
                 from /usr/include/boost/range/iterator_range.hpp:13,
                 from /usr/include/boost/assign/list_of.hpp:20,
                 from rpcrawtransaction.cpp:6:
/usr/include/boost/variant/get.hpp: In instantiation of ‘typename boost::add_reference<T>::type boost::strict_get(boost::variant<T0, T1, T2, T3, T4, T5, T6, T7, T8, T9, T10, T11, T12, T13, T14, T15, T16, T17, T18, T19>&) [with U = const CScriptID&; T0 = CNoDestination; T1 = CKeyID; T2 = CScriptID; T3 = CSecretAddress; T4 = boost::detail::variant::void_; T5 = boost::detail::variant::void_; T6 = boost::detail::variant::void_; T7 = boost::detail::variant::void_; T8 = boost::detail::variant::void_; T9 = boost::detail::variant::void_; T10 = boost::detail::variant::void_; T11 = boost::detail::variant::void_; T12 = boost::detail::variant::void_; T13 = boost::detail::variant::void_; T14 = boost::detail::variant::void_; T15 = boost::detail::variant::void_; T16 = boost::detail::variant::void_; T17 = boost::detail::variant::void_; T18 = boost::detail::variant::void_; T19 = boost::detail::variant::void_; typename boost::add_reference<T>::type = const CScriptID&]’:
/usr/include/boost/variant/get.hpp:284:25:   required from ‘typename boost::add_reference<T>::type boost::get(boost::variant<T0, T1, T2, T3, T4, T5, T6, T7, T8, T9, T10, T11, T12, T13, T14, T15, T16, T17, T18, T19>&) [with U = const CScriptID&; T0 = CNoDestination; T1 = CKeyID; T2 = CScriptID; T3 = CSecretAddress; T4 = boost::detail::variant::void_; T5 = boost::detail::variant::void_; T6 = boost::detail::variant::void_; T7 = boost::detail::variant::void_; T8 = boost::detail::variant::void_; T9 = boost::detail::variant::void_; T10 = boost::detail::variant::void_; T11 = boost::detail::variant::void_; T12 = boost::detail::variant::void_; T13 = boost::detail::variant::void_; T14 = boost::detail::variant::void_; T15 = boost::detail::variant::void_; T16 = boost::detail::variant::void_; T17 = boost::detail::variant::void_; T18 = boost::detail::variant::void_; T19 = boost::detail::variant::void_; typename boost::add_reference<T>::type = const CScriptID&]’
rpcrawtransaction.cpp:221:77:   required from here
/usr/include/boost/variant/get.hpp:178:5: error: invalid application of ‘sizeof’ to incomplete type ‘boost::STATIC_ASSERTION_FAILURE<false>’
     BOOST_STATIC_ASSERT_MSG(
     ^
makefile.unix:221: recipe for target 'obj/rpcrawtransaction.o' failed
make: *** [obj/rpcrawtransaction.o] Error 1
node-VirtualBox src # strip navcoind
strip: 'navcoind': No such file
shahim
Legendary
*
Offline Offline

Activity: 1082
Merit: 1002


View Profile
September 13, 2016, 01:39:31 PM
 #19231

What distro are you using?
Your problem is boost related.

Edit: When I google your problem it is all about boost Version 1.5.8 . Here is the same: https://bitcointalk.org/index.php?topic=1312757.0

Best try to get a boost Version 1.5.4 . Or use another distro. Ubuntu 14 / 15 and debien 7 are great distros to compile without problems.

hashforce101
Legendary
*
Offline Offline

Activity: 1022
Merit: 1000


View Profile
September 13, 2016, 02:03:45 PM
 #19232

Great to see no one reacts to the sell wall on Poloniex.
We should all eat it like Piranhas. Or does it wants to drive the price down.

Anon coming this is our big moment.
Fantastic week and future ahead
DragonBall Fan
Newbie
*
Offline Offline

Activity: 31
Merit: 0


View Profile
September 13, 2016, 02:46:57 PM
 #19233

What distro are you using?
Your problem is boost related.

Edit: When I google your problem it is all about boost Version 1.5.8 . Here is the same: https://bitcointalk.org/index.php?topic=1312757.0

Best try to get a boost Version 1.5.4 . Or use another distro. Ubuntu 14 / 15 and debien 7 are great distros to compile without problems.


I use linux mint 18 cinnamon 64bit.
I will try another distro
shahim
Legendary
*
Offline Offline

Activity: 1082
Merit: 1002


View Profile
September 13, 2016, 02:53:02 PM
 #19234

What distro are you using?
Your problem is boost related.

Edit: When I google your problem it is all about boost Version 1.5.8 . Here is the same: https://bitcointalk.org/index.php?topic=1312757.0

Best try to get a boost Version 1.5.4 . Or use another distro. Ubuntu 14 / 15 and debien 7 are great distros to compile without problems.


I use linux mint 18 cinnamon 64bit.
I will try another distro

Go with ubuntu and you will be able to compile with our instructions!
mogrith
Legendary
*
Offline Offline

Activity: 1470
Merit: 1001


Use Coinbase Account almosanywhere with Shift card


View Profile WWW
September 13, 2016, 04:26:14 PM
 #19235

 yes I did see msg 19298

did repair wallet no change doing a rescan now It's still running. Hope the coins come back with way the price is rising.

NAV is now on Crypto-trade.net
https://crypto-trade.net

new exchange low volume not in USA  not sure where but chat box has a lot of Cyrillic messages

Mogrith,

have you seen my answer and followed the steps? Refering to the two transactions that got missing...

Merge mine BLC+PHO+ELT+XDQ+BBTC+UMO+LIT pool is open http://la1.blakecoin.com tips: 1MogRiTHpQZ7bkpq49cSVWADrTt7Jrghp
BitcoinFX
Legendary
*
Offline Offline

Activity: 2492
Merit: 1577


https://youtu.be/DsAVx0u9Cw4 ... Dr. WHO < KLF


View Profile WWW
September 13, 2016, 05:30:46 PM
 #19236

yes I did see msg 19298

did repair wallet no change doing a rescan now It's still running. Hope the coins come back with way the price is rising.

NAV Tor nodes have mostly been running stable, all on the correct chain height etc., (ref. your post regarding your sending issue) I will double check everything server side, although these are just regular NAV nodes ofc.

~ For a daemon NAV server conf these options have improved stability;

nosmsg=1
txindex=1
maxorphanblocks=1000

"Bitcoin OG" Bored/Board of making others wealthy! | 1JXFXUBGs2ZtEDAQMdZ3tkCKo38nT2XSEp | Bitcoin is BTC | CSW is NOT Satoshi Nakamoto | I Mine BTC, LTC, ZEC, XMR and GAP | Support my BTC on Tor addnodes Project | Media enquiries : Wu Ming | Enjoy The Money Machine | "You cannot compete with Open Source" and "Cryptography != Banana"
BitcoinFX
Legendary
*
Offline Offline

Activity: 2492
Merit: 1577


https://youtu.be/DsAVx0u9Cw4 ... Dr. WHO < KLF


View Profile WWW
September 13, 2016, 05:41:35 PM
 #19237

What distro are you using?
Your problem is boost related.

Edit: When I google your problem it is all about boost Version 1.5.8 . Here is the same: https://bitcointalk.org/index.php?topic=1312757.0

Best try to get a boost Version 1.5.4 . Or use another distro. Ubuntu 14 / 15 and debien 7 are great distros to compile without problems.


I use linux mint 18 cinnamon 64bit.
I will try another distro

Go with ubuntu and you will be able to compile with our instructions!

With Ubuntu desktop I often recommend running GNOME Metacity, instead of Unity.

sudo apt-get install gnome-session-fallback

- http://www.howtogeek.com/189912/how-to-install-the-gnome-classic-desktop-in-ubuntu-14.04/

Which is hassle free and that bit faster for getting things done when using GUI coin wallets!   Smiley

"Bitcoin OG" Bored/Board of making others wealthy! | 1JXFXUBGs2ZtEDAQMdZ3tkCKo38nT2XSEp | Bitcoin is BTC | CSW is NOT Satoshi Nakamoto | I Mine BTC, LTC, ZEC, XMR and GAP | Support my BTC on Tor addnodes Project | Media enquiries : Wu Ming | Enjoy The Money Machine | "You cannot compete with Open Source" and "Cryptography != Banana"
DragonBall Fan
Newbie
*
Offline Offline

Activity: 31
Merit: 0


View Profile
September 13, 2016, 07:17:14 PM
Last edit: September 14, 2016, 01:00:47 AM by DragonBall Fan
 #19238

I use linux mint 18 cinnamon 64bit.
I will try another distro

Go with ubuntu and you will be able to compile with our instructions!

I spend much time, with this problem..

I tested this all distros:
- Linux Mint 18 Cinnamon 64bit
- Linux Mint Debian Edition 64bit
- Debian 8.5.0 Cinnamon 64bit
- Trisquel 7.0 64bit
- Ubuntu 14.04 64bit

And on all the normal build way doesnt work
Code:
sudo apt-get install build-essential
sudo apt-get install libssl-dev
sudo apt-get install libdb++-dev
sudo apt-get install libboost-all-dev
sudo apt-get install libqrencode-dev
sudo apt-get install libgmp3-dev
cd src/
make -f makefile.unix

Only in ubuntu with this way I could build the navcoind
in fact, try this. It works for me every time when i have to reinstall my VM. Starting from the root directory you checked out the project to eg. ~/navcoin2/

Code:
sudo apt-get install build-essential libtool autotools-dev automake pkg-config libssl-dev libevent-dev bsdmainutils libboost-all-dev
sudo add-apt-repository ppa:bitcoin/bitcoin
sudo apt-get update
sudo apt-get install libdb4.8-dev libdb4.8++-dev libzmq3-dev libgmp3-dev libminiupnpc-dev
rm -r src/obj
mkdir src/obj
mkdir src/obj/crypto
mkdir src/obj/support
sudo chmod 755 src/leveldb/build_detect_platform
rm -r src/secp256k1/
cd src
wget www.navajocoin.org/files/secp.zip
unzip secp.zip
cd secp256k1
sudo chmod 777 *
./autogen.sh
./configure --enable-module-recovery
make
cd ..
make -f makefile.unix clean
make -f makefile.unix USE_UPNP=1

If this works for you, I will update the linux build instructions.

To build the navcoin-qt, I must install the Qt Creator and it was showing me some issues..
NAV starts now in ubuntu but I am not sure that I make everything right.
It is really difficult to build the client for linux

Edit:
After long try and error I was able to build the navcoin-qt for
- Linux Mint 18 Cinnamon 64bit
- Linux Mint Debian Edition 64bit
But Qt Creator shows me over 30 issues by the build process.
But navcoin-qt seems to work.

Just navcoind was for me not possible to build on a other system then ubuntu.
igona1960
Newbie
*
Offline Offline

Activity: 34
Merit: 0


View Profile
September 14, 2016, 12:56:12 AM
 #19239

It is possible obtain the private key? and then open my wallet in electrun wallet?

it seems that my computer to run bad, the attacker has corrupted everything, i can not connect to the network.

I have many computers to try and also have a backup created with acronis 4 days ago.

Hopefully i can connect to the network and to extract the coins, only use few coins to mine.

first of all, do not open that wallet.exe again until we can figure out some stuff. do not let it synch or it might send out those 500k coins.

secondly: hmm are you sure these are not your addresses? or sent them yourself?

since the 599k coins are not shown on the block explorer. than if you were hacked. it seemed like they did not have a copy of your wallet and tried to sent from their own computer but it seems they are trying to send from your computer. this means you have a scryt somewhere running. but it also means that the request to send never made it outside your network therefore outside nodes have not accepted anything. Which is good. so DO NOT synch your wallet. if you have to open your wallet, disconnect your internet.

maybe you can delete this last request and hope it never was seen outside.

also check for malware.

open task manager and look for suspicious behavior.
check you configuration "config file"  and see if some one tried to change stuff.

was there any other coin you downloaded recently. a lot of shitcoin have a lot of malware for this purpose.


Good advice. Don't sync it. You could try restoring your wallet to a different computer (assuming you have a backup) and resyncing the block chain using one of our blockchain downloads from the downloads page http://navcoin.org/downloads

If the transaction hasn't been submitted to the network, the balance might return to your wallet. If it's been broadcast there's pretty much nothing anyone can do.

Hi!

at the end there was no problem with my wallet, i extracted and recovered my nav.


I have extracted into two different wallet, one at poloniex and the other to electrum, after have been returned 8,000 NAV, incredible: 
https://chainz.cryptoid.info/nav/address.dws?NS1FHJSXysvirmMMBaCG1cBu4runQEgNw7.htm

 Smiley

Account NS1FHJSX... surely isn't malware, everything is solved.


I up a image of a confused transaction, when i sent 2 nav to electrum  and 8,000 nav desapear, but for my wallet not disappear, here is the confusion:
https://s21.postimg.org/xy5q9rs2v/hackedorclean_wallet_80kb.png

------------------------------------------------------------------------------------------------------------

My old wallet:
https://chainz.cryptoid.info/nav/address.dws?NRGhvnK3Y39P5WDpK7pfu5QunSTUNufTSW.htm

My electrum wallet:
https://chainz.cryptoid.info/nav/address.dws?NhUWVmmGYrLqcbnw75PZ25ZNX1EEsUPM4w.htm


The mysterious account:
https://chainz.cryptoid.info/nav/address.dws?NS1FHJSXysvirmMMBaCG1cBu4runQEgNw7.htm














igona1960
Newbie
*
Offline Offline

Activity: 34
Merit: 0


View Profile
September 14, 2016, 01:07:53 AM
 #19240

I have pleasure to connect a node, but with fewer coins. 100,000 coins are enough?

I will create a new account, i'm not going to risk, no more money.  Cheesy
Pages: « 1 ... 912 913 914 915 916 917 918 919 920 921 922 923 924 925 926 927 928 929 930 931 932 933 934 935 936 937 938 939 940 941 942 943 944 945 946 947 948 949 950 951 952 953 954 955 956 957 958 959 960 961 [962] 963 964 965 966 967 968 969 970 971 972 973 974 975 976 977 978 979 980 981 982 983 984 985 986 987 988 989 990 991 992 993 994 995 996 997 998 999 1000 1001 1002 1003 1004 1005 1006 1007 1008 1009 1010 1011 1012 ... 1243 »
  Print  
 
Jump to:  

Powered by MySQL Powered by PHP Powered by SMF 1.1.19 | SMF © 2006-2009, Simple Machines Valid XHTML 1.0! Valid CSS!