Bitcoin Forum
October 16, 2019, 08:38:01 PM *
News: If you like a topic and you see an orange "bump" link, click it. More info.
 
   Home   Help Search Login Register More  
Pages: « 1 ... 425 426 427 428 429 430 431 432 433 434 435 436 437 438 439 440 441 442 443 444 445 446 447 448 449 450 451 452 453 454 455 456 457 458 459 460 461 462 463 464 465 466 467 468 469 470 471 472 473 474 [475] 476 477 478 479 480 481 482 483 484 »
  Print  
Author Topic: [BBR] Boolberry: Privacy and Security - Guaranteed Since 2014  (Read 1172361 times)
This is a self-moderated topic. If you do not want to be moderated by the person who started this topic, create a new topic.
hdtqisg
Sr. Member
****
Offline Offline

Activity: 658
Merit: 250

YoBit.Net - DASH (DASH) Exchange


View Profile
October 16, 2018, 09:27:44 AM
 #9481

I always hope that BBR will be supported on mobile phones in the near future! Because mobile devices are devices a lot of people are using for personal and paid purposes.

 
                                . ██████████.
                              .████████████████.
                           .██████████████████████.
                        -█████████████████████████████
                     .██████████████████████████████████.
                  -█████████████████████████████████████████
               -███████████████████████████████████████████████
           .-█████████████████████████████████████████████████████.
        .████████████████████████████████████████████████████████████
       .██████████████████████████████████████████████████████████████.
       .██████████████████████████████████████████████████████████████.
       ..████████████████████████████████████████████████████████████..
       .   .██████████████████████████████████████████████████████.
       .      .████████████████████████████████████████████████.

       .       .██████████████████████████████████████████████
       .    ██████████████████████████████████████████████████████
       .█████████████████████████████████████████████████████████████.
        .███████████████████████████████████████████████████████████
           .█████████████████████████████████████████████████████
              .████████████████████████████████████████████████
                   ████████████████████████████████████████
                      ██████████████████████████████████
                          ██████████████████████████
                             ████████████████████
                               ████████████████
                                   █████████
CryptoTalk.org| 
MAKE POSTS AND EARN BTC!
🏆
1571258281
Hero Member
*
Offline Offline

Posts: 1571258281

View Profile Personal Message (Offline)

Ignore
1571258281
Reply with quote  #2

1571258281
Report to moderator
1571258281
Hero Member
*
Offline Offline

Posts: 1571258281

View Profile Personal Message (Offline)

Ignore
1571258281
Reply with quote  #2

1571258281
Report to moderator
1571258281
Hero Member
*
Offline Offline

Posts: 1571258281

View Profile Personal Message (Offline)

Ignore
1571258281
Reply with quote  #2

1571258281
Report to moderator
Advertised sites are not endorsed by the Bitcoin Forum. They may be unsafe, untrustworthy, or illegal in your jurisdiction. Advertise here.
versprichnix
Sr. Member
****
Offline Offline

Activity: 755
Merit: 277


View Profile
October 16, 2018, 11:41:50 AM
 #9482

Hello, compiling version 0.3.0.68 on ubuntu 18.04 was ok, the new version 0.3.0.80 cancels on linking with the following messages:

Quote
[ 70%] Linking CXX executable unit_tests
/tmp/cc8Fa5Kb.ltrans4.ltrans.o: In function `epee::net_utils::content_encoding_gzip::update_in(std::__cxx11::basic_string<char, std::char_traits<char>, std::allocator<char> >&)':
<artificial>:(.text+0x19ea): undefined reference to `inflate'
<artificial>:(.text+0x1ab9): undefined reference to `inflateReset'
<artificial>:(.text+0x1ad5): undefined reference to `inflate'
<artificial>:(.text+0x1af8): undefined reference to `inflate'
/tmp/cc8Fa5Kb.ltrans4.ltrans.o: In function `epee::net_utils::content_encoding_gzip::~content_encoding_gzip()':
<artificial>:(.text+0x1e34): undefined reference to `inflateEnd'
<artificial>:(.text+0x1e40): undefined reference to `deflateEnd'
/tmp/cc8Fa5Kb.ltrans4.ltrans.o: In function `epee::net_utils::content_encoding_gzip::~content_encoding_gzip() [clone .lto_priv.2178]':
<artificial>:(.text+0x4e74): undefined reference to `inflateEnd'
<artificial>:(.text+0x4e80): undefined reference to `deflateEnd'
/tmp/cc8Fa5Kb.ltrans5.ltrans.o: In function `epee::net_utils::http::http_simple_client::analize_cached_header_and_invoke_state()':
<artificial>:(.text+0x6ecd): undefined reference to `inflateInit2_'
<artificial>:(.text+0x6efb): undefined reference to `deflateInit2_'
<artificial>:(.text+0x7a90): undefined reference to `inflateInit_'
<artificial>:(.text+0x7aad): undefined reference to `deflateInit_'
collect2: error: ld returned 1 exit status
tests/CMakeFiles/unit_tests.dir/build.make:631: recipe for target 'tests/unit_tests' failed
make[3]: *** [tests/unit_tests] Error 1
make[3]: Leaving directory '/home/bbr/opt/boolberry-0.3.0.80/build/release'
CMakeFiles/Makefile2:708: recipe for target 'tests/CMakeFiles/unit_tests.dir/all' failed
make[2]: *** [tests/CMakeFiles/unit_tests.dir/all] Error 2
make[2]: Leaving directory '/home/bbr/opt/boolberry-0.3.0.80/build/release'
Makefile:140: recipe for target 'all' failed
make[1]: *** [all] Error 2
make[1]: Leaving directory '/home/bbr/opt/boolberry-0.3.0.80/build/release'
Makefile:20: recipe for target 'build-release' failed
make: *** [build-release] Error 2

Any hint?
youretz
Member
**
Offline Offline

Activity: 126
Merit: 10


View Profile
October 16, 2018, 07:09:56 PM
 #9483

any exchange listing?
tbearhere
Legendary
*
Offline Offline

Activity: 1890
Merit: 1001


Zano https://zano.org/ ____ Algo ProgPowZ


View Profile
October 16, 2018, 07:26:23 PM
 #9484

any exchange listing?

Yes.

https://coinmarketcap.com/currencies/boolberry/

https://btc-alpha.com/exchange/BBR_BTC/

https://app.stex.com/en/basic-trade/pair/BTC/BBR/1D


ZANO New Sources|1st ProgPowZ|PoW/PoS Hybrid|Scalable|Private|Contracting https://zano.org/   Donation BTC 1Jrx5UCkY4p6AQ2kHFu6yZDMFj88KNggkR Our enemy > http://themillenniumreport.com/2018/06/the-khazarian-mafia-you-dont-know-what-you-dont-know/
crypto_zoidberg
Hero Member
*****
Offline Offline

Activity: 941
Merit: 559



View Profile WWW
October 16, 2018, 08:50:56 PM
 #9485

Hello, compiling version 0.3.0.68 on ubuntu 18.04 was ok, the new version 0.3.0.80 cancels on linking with the following messages:

Quote
[ 70%] Linking CXX executable unit_tests
/tmp/cc8Fa5Kb.ltrans4.ltrans.o: In function `epee::net_utils::content_encoding_gzip::update_in(std::__cxx11::basic_string<char, std::char_traits<char>, std::allocator<char> >&)':
<artificial>Sad.text+0x19ea): undefined reference to `inflate'
<artificial>Sad.text+0x1ab9): undefined reference to `inflateReset'
<artificial>Sad.text+0x1ad5): undefined reference to `inflate'
<artificial>Sad.text+0x1af8): undefined reference to `inflate'
/tmp/cc8Fa5Kb.ltrans4.ltrans.o: In function `epee::net_utils::content_encoding_gzip::~content_encoding_gzip()':
<artificial>Sad.text+0x1e34): undefined reference to `inflateEnd'
<artificial>Sad.text+0x1e40): undefined reference to `deflateEnd'
/tmp/cc8Fa5Kb.ltrans4.ltrans.o: In function `epee::net_utils::content_encoding_gzip::~content_encoding_gzip() [clone .lto_priv.2178]':
<artificial>Sad.text+0x4e74): undefined reference to `inflateEnd'
<artificial>Sad.text+0x4e80): undefined reference to `deflateEnd'
/tmp/cc8Fa5Kb.ltrans5.ltrans.o: In function `epee::net_utils::http::http_simple_client::analize_cached_header_and_invoke_state()':
<artificial>Sad.text+0x6ecd): undefined reference to `inflateInit2_'
<artificial>Sad.text+0x6efb): undefined reference to `deflateInit2_'
<artificial>Sad.text+0x7a90): undefined reference to `inflateInit_'
<artificial>Sad.text+0x7aad): undefined reference to `deflateInit_'
collect2: error: ld returned 1 exit status
tests/CMakeFiles/unit_tests.dir/build.make:631: recipe for target 'tests/unit_tests' failed
make[3]: *** [tests/unit_tests] Error 1
make[3]: Leaving directory '/home/bbr/opt/boolberry-0.3.0.80/build/release'
CMakeFiles/Makefile2:708: recipe for target 'tests/CMakeFiles/unit_tests.dir/all' failed
make[2]: *** [tests/CMakeFiles/unit_tests.dir/all] Error 2
make[2]: Leaving directory '/home/bbr/opt/boolberry-0.3.0.80/build/release'
Makefile:140: recipe for target 'all' failed
make[1]: *** [all] Error 2
make[1]: Leaving directory '/home/bbr/opt/boolberry-0.3.0.80/build/release'
Makefile:20: recipe for target 'build-release' failed
make: *** [build-release] Error 2

Any hint?

Remove build folder and re-run cmake .., that will help. We added new files, sometimes cmake need to be re-runed.


Zoidberg

dobriydimka
Newbie
*
Offline Offline

Activity: 5
Merit: 0


View Profile
October 16, 2018, 10:43:23 PM
 #9486

Can't deposit btc-alpha wallet warning: "Failed to send transaction: invalid address"
Could u help me?

versprichnix
Sr. Member
****
Offline Offline

Activity: 755
Merit: 277


View Profile
October 16, 2018, 11:07:03 PM
 #9487

Remove build folder and re-run cmake .., that will help. We added new files, sometimes cmake need to be re-runed.

Same errors as before. I did not use "cmake", but only "make", as described in "README.md". I don't know how to use cmake in this context. (Ubuntu 18.04.1)
crypto_zoidberg
Hero Member
*****
Offline Offline

Activity: 941
Merit: 559



View Profile WWW
October 17, 2018, 12:24:30 AM
 #9488


What build do you use? Can you send a screenshot? (in PM )


crypto_zoidberg
Hero Member
*****
Offline Offline

Activity: 941
Merit: 559



View Profile WWW
October 17, 2018, 12:26:30 AM
 #9489

Remove build folder and re-run cmake .., that will help. We added new files, sometimes cmake need to be re-runed.

Same errors as before. I did not use "cmake", but only "make", as described in "README.md". I don't know how to use cmake in this context. (Ubuntu 18.04.1)

"make" use "cmake: to generate sub-"make".

Have you removed the whole build folder and tried to make it again?


dobriydimka
Newbie
*
Offline Offline

Activity: 5
Merit: 0


View Profile
October 17, 2018, 06:01:16 AM
 #9490

http://i78.fastpic.ru/big/2018/1017/f0/60ef3a1e5900c8c0f4ed8394834595f0.jpg
Software version:0.3.0.44(083358b)
versprichnix
Sr. Member
****
Offline Offline

Activity: 755
Merit: 277


View Profile
October 17, 2018, 07:28:06 AM
 #9491

Remove build folder and re-run cmake .., that will help. We added new files, sometimes cmake need to be re-runed.

Same errors as before. I did not use "cmake", but only "make", as described in "README.md". I don't know how to use cmake in this context. (Ubuntu 18.04.1)

"make" use "cmake: to generate sub-"make".

Have you removed the whole build folder and tried to make it again?

I renamed the build folder, and it was recreated with the new make. But with same error messages.
teknohog
Sr. Member
****
Offline Offline

Activity: 510
Merit: 252


555


View Profile WWW
October 17, 2018, 01:39:34 PM
 #9492

I renamed the build folder, and it was recreated with the new make. But with same error messages.

I've also struggled with the recent build issue, which is obviously related to zlib/gzip. This commit seems to be to blame:

https://github.com/cryptozoidberg/boolberry/commit/d1be390e63147631fa2ca16a48f74b8333c86bfb

as it builds fine when checking out the preceding version. This one looks like it bundles a copy of zlib instead of using external libraries -- I wonder why?


world famous math art | masternodes are bad, mmmkay?
Treat your coins with respect. Only "pump and dump" people.
crypto_zoidberg
Hero Member
*****
Offline Offline

Activity: 941
Merit: 559



View Profile WWW
October 17, 2018, 06:23:40 PM
 #9493


You are using very old build bro, please download the latest release https://github.com/cryptozoidberg/boolberry/releases/tag/v0.3.0.80 , it should work perfect!





crypto_zoidberg
Hero Member
*****
Offline Offline

Activity: 941
Merit: 559



View Profile WWW
October 17, 2018, 06:34:25 PM
 #9494

I renamed the build folder, and it was recreated with the new make. But with same error messages.

I've also struggled with the recent build issue, which is obviously related to zlib/gzip. This commit seems to be to blame:

https://github.com/cryptozoidberg/boolberry/commit/d1be390e63147631fa2ca16a48f74b8333c86bfb

as it builds fine when checking out the preceding version. This one looks like it bundles a copy of zlib instead of using external libraries -- I wonder why?



We'll install Ubuntu 18.04 and check this issue asap and come back to you guys with a solution. Sorry for inconvenience.


clintar2
Full Member
***
Offline Offline

Activity: 202
Merit: 104


View Profile
October 19, 2018, 08:25:15 AM
 #9495

Hello, compiling version 0.3.0.68 on ubuntu 18.04 was ok, the new version 0.3.0.80 cancels on linking with the following messages:

Quote
[ 70%] Linking CXX executable unit_tests
/tmp/cc8Fa5Kb.ltrans4.ltrans.o: In function `epee::net_utils::content_encoding_gzip::update_in(std::__cxx11::basic_string<char, std::char_traits<char>, std::allocator<char> >&)':
<artificial>Sad.text+0x19ea): undefined reference to `inflate'
<artificial>Sad.text+0x1ab9): undefined reference to `inflateReset'
<artificial>Sad.text+0x1ad5): undefined reference to `inflate'
<artificial>Sad.text+0x1af8): undefined reference to `inflate'
/tmp/cc8Fa5Kb.ltrans4.ltrans.o: In function `epee::net_utils::content_encoding_gzip::~content_encoding_gzip()':
<artificial>Sad.text+0x1e34): undefined reference to `inflateEnd'
<artificial>Sad.text+0x1e40): undefined reference to `deflateEnd'
/tmp/cc8Fa5Kb.ltrans4.ltrans.o: In function `epee::net_utils::content_encoding_gzip::~content_encoding_gzip() [clone .lto_priv.2178]':
<artificial>Sad.text+0x4e74): undefined reference to `inflateEnd'
<artificial>Sad.text+0x4e80): undefined reference to `deflateEnd'
/tmp/cc8Fa5Kb.ltrans5.ltrans.o: In function `epee::net_utils::http::http_simple_client::analize_cached_header_and_invoke_state()':
<artificial>Sad.text+0x6ecd): undefined reference to `inflateInit2_'
<artificial>Sad.text+0x6efb): undefined reference to `deflateInit2_'
<artificial>Sad.text+0x7a90): undefined reference to `inflateInit_'
<artificial>Sad.text+0x7aad): undefined reference to `deflateInit_'
collect2: error: ld returned 1 exit status
tests/CMakeFiles/unit_tests.dir/build.make:631: recipe for target 'tests/unit_tests' failed
make[3]: *** [tests/unit_tests] Error 1
make[3]: Leaving directory '/home/bbr/opt/boolberry-0.3.0.80/build/release'
CMakeFiles/Makefile2:708: recipe for target 'tests/CMakeFiles/unit_tests.dir/all' failed
make[2]: *** [tests/CMakeFiles/unit_tests.dir/all] Error 2
make[2]: Leaving directory '/home/bbr/opt/boolberry-0.3.0.80/build/release'
Makefile:140: recipe for target 'all' failed
make[1]: *** [all] Error 2
make[1]: Leaving directory '/home/bbr/opt/boolberry-0.3.0.80/build/release'
Makefile:20: recipe for target 'build-release' failed
make: *** [build-release] Error 2

Any hint?
Try just doing
Code:
make daemon
and
Code:
make simplewallet
so it skips the tests that fail. Maybe
Code:
make qt-boolbd
if you are trying to make that.
In tests/CMakeLists.txt, the ones that are failing need
Code:
zlibstatic
added to their target_link_libraries lines
dobriydimka
Newbie
*
Offline Offline

Activity: 5
Merit: 0


View Profile
October 19, 2018, 06:04:15 PM
 #9496

You are using very old build bro, please download the latest release https://github.com/cryptozoidberg/boolberry/releases/tag/v0.3.0.80 , it should work perfect!

"22841 blocks behind"
and no connections 2 days (((
crypto_zoidberg
Hero Member
*****
Offline Offline

Activity: 941
Merit: 559



View Profile WWW
October 19, 2018, 07:47:47 PM
 #9497

You are using very old build bro, please download the latest release https://github.com/cryptozoidberg/boolberry/releases/tag/v0.3.0.80 , it should work perfect!

"22841 blocks behind"
and no connections 2 days (((

Please try to stop it, remove p2pstate.bin file and re-run, this should help with connectivity.


dobriydimka
Newbie
*
Offline Offline

Activity: 5
Merit: 0


View Profile
October 19, 2018, 08:46:53 PM
 #9498

You are using very old build bro, please download the latest release https://github.com/cryptozoidberg/boolberry/releases/tag/v0.3.0.80 , it should work perfect!

"22841 blocks behind"
and no connections 2 days (((

Please try to stop it, remove p2pstate.bin file and re-run, this should help with connectivity.


Thank you. Its work!
versprichnix
Sr. Member
****
Offline Offline

Activity: 755
Merit: 277


View Profile
October 19, 2018, 10:08:47 PM
 #9499

...
Try just doing
Code:
make daemon
and
Code:
make simplewallet
so it skips the tests that fail. Maybe
Code:
make qt-boolbd
if you are trying to make that.
In tests/CMakeLists.txt, the ones that are failing need
Code:
zlibstatic
added to their target_link_libraries lines

It's running fine now. Did change the following three lines in "tests/CMakeLists.txt":

Quote
target_link_libraries(functional_tests zlibstatic currency_core wallet common crypto upnpc-static ${CMAKE_THREAD_LIBS_INIT} ${Boost_LIBRARIES})
target_link_libraries(unit_tests zlibstatic currency_core common wallet crypto gtest_main lmdb ${CMAKE_THREAD_LIBS_INIT} ${Boost_LIBRARIES})
target_link_libraries(exchange_test zlibstatic ${CMAKE_THREAD_LIBS_INIT} ${Boost_LIBRARIES})
crypto_zoidberg
Hero Member
*****
Offline Offline

Activity: 941
Merit: 559



View Profile WWW
October 20, 2018, 02:22:06 AM
 #9500

...
Try just doing
Code:
make daemon
and
Code:
make simplewallet
so it skips the tests that fail. Maybe
Code:
make qt-boolbd
if you are trying to make that.
In tests/CMakeLists.txt, the ones that are failing need
Code:
zlibstatic
added to their target_link_libraries lines

It's running fine now. Did change the following three lines in "tests/CMakeLists.txt":

Quote
target_link_libraries(functional_tests zlibstatic currency_core wallet common crypto upnpc-static ${CMAKE_THREAD_LIBS_INIT} ${Boost_LIBRARIES})
target_link_libraries(unit_tests zlibstatic currency_core common wallet crypto gtest_main lmdb ${CMAKE_THREAD_LIBS_INIT} ${Boost_LIBRARIES})
target_link_libraries(exchange_test zlibstatic ${CMAKE_THREAD_LIBS_INIT} ${Boost_LIBRARIES})


Thanks a lot for posting solution, we were quite busy these days, I just pushed this update which fixes the issue.
Anyone is welcome to pull-request in this situations.

 

Pages: « 1 ... 425 426 427 428 429 430 431 432 433 434 435 436 437 438 439 440 441 442 443 444 445 446 447 448 449 450 451 452 453 454 455 456 457 458 459 460 461 462 463 464 465 466 467 468 469 470 471 472 473 474 [475] 476 477 478 479 480 481 482 483 484 »
  Print  
 
Jump to:  

Sponsored by , a Bitcoin-accepting VPN.
Powered by MySQL Powered by PHP Powered by SMF 1.1.19 | SMF © 2006-2009, Simple Machines Valid XHTML 1.0! Valid CSS!