Bitcoin Forum
December 08, 2016, 10:16:02 AM *
News: Latest stable version of Bitcoin Core: 0.13.1  [Torrent].
 
   Home   Help Search Donate Login Register  
Pages: « 1 2 3 4 5 6 7 8 9 10 11 12 13 14 15 16 17 18 19 20 21 22 23 24 25 26 27 28 29 [30] 31 32 33 34 35 36 37 38 39 40 41 42 43 44 45 46 47 48 49 50 51 52 53 54 55 56 57 58 59 60 61 62 63 64 65 66 67 68 69 70 71 72 73 74 75 76 77 78 79 80 ... 155 »
  Print  
Author Topic: Vanitygen: Vanity bitcoin address generator/miner [v0.22]  (Read 809241 times)
deepceleron
Legendary
*
Offline Offline

Activity: 1470



View Profile WWW
May 24, 2012, 02:53:34 AM
 #581

Attempting to run oclvanitygen I received this error:

Code:
clGetPlatformIDs(0): Unknown code -1001
clGetPlatformIDs(0): Unknown code -1001

With SDK 2.1 oclvanitygen didn't give me a problem running, but with SDK 2.4 I get the above message.
With 2.4 it didn't work for me, but SDK 2.5 and above is fine (Catalyst 11.11)

1481192162
Hero Member
*
Offline Offline

Posts: 1481192162

View Profile Personal Message (Offline)

Ignore
1481192162
Reply with quote  #2

1481192162
Report to moderator
1481192162
Hero Member
*
Offline Offline

Posts: 1481192162

View Profile Personal Message (Offline)

Ignore
1481192162
Reply with quote  #2

1481192162
Report to moderator
Advertised sites are not endorsed by the Bitcoin Forum. They may be unsafe, untrustworthy, or illegal in your jurisdiction. Advertise here.
1481192162
Hero Member
*
Offline Offline

Posts: 1481192162

View Profile Personal Message (Offline)

Ignore
1481192162
Reply with quote  #2

1481192162
Report to moderator
check_status
Full Member
***
Offline Offline

Activity: 196


Web Dev, Db Admin, Computer Technician


View Profile
May 24, 2012, 05:47:20 AM
 #582

I got everything running. I must have installed SDK v2.4 incorrectly, maybe skipped a step. Re-installation fixed the issue.
./oclvanitygen produced 25 Mkeys/s on the GPU. Thats like 200x more key searches than on my CPU.  Shocked  Cool
It took about 8 hours to find 1+6 '1abcdef'. How much longer would it take to find 1+7 or 1+8?

For Bitcoin to be a true global currency the value of BTC needs always to rise.
If BTC became the global currency & money supply = 100 Trillion then ⊅1.00 BTC = $4,761,904.76.
P2Pool Server List | How To's and Guides Mega List |  1EndfedSryGUZK9sPrdvxHntYzv2EBexGA
Qoheleth
Legendary
*
Offline Offline

Activity: 882


Spurn wild goose chases. Seek that which endures.


View Profile WWW
May 26, 2012, 05:33:17 AM
 #583

Do these apps support generating addresses whose secret component is in mini private key format?

I got everything running. I must have installed SDK v2.4 incorrectly, maybe skipped a step. Re-installation fixed the issue.
./oclvanitygen produced 25 Mkeys/s on the GPU. Thats like 200x more key searches than on my CPU.  Shocked  Cool
It took about 8 hours to find 1+6 '1abcdef'. How much longer would it take to find 1+7 or 1+8?
1+7 would probably take about 58x what 1+6 took. So, three weeks or so.
1+8 would take about 58x that, so about three years.

If there is something that will make Bitcoin succeed, it is growth of utility - greater quantity and variety of goods and services offered for BTC. If there is something that will make Bitcoin fail, it is the culture of naive fools and conmen, the former convinced that BTC is a magic box that will turn them into millionaires, and the latter arriving by the busload to devour them.
nimda
Hero Member
*****
Offline Offline

Activity: 784


0xFB0D8D1534241423


View Profile
May 26, 2012, 03:49:54 PM
 #584

I'd like to see  this done in such a way that one could have their address generated elsewhere, peerhpas even paying for it as a service, without the third party gaining access to the private key. There was some discussion about it, and it's certainly possible, but it seems to require code changes which are beyond my level of C...

I recommend asking me for a signature from my GPG key before doing a trade. I will NEVER deny such a request.
check_status
Full Member
***
Offline Offline

Activity: 196


Web Dev, Db Admin, Computer Technician


View Profile
May 27, 2012, 03:09:44 AM
 #585

A distributed Vanity Address generator might be faster, dividing work across all GPU's instead of one work per GPU. There are lots of distributed designs out there already, some open source but for CUDA, would need to convert CUDA language to OpenCL language. This would make it easier for those with large farms to utilize an address generator without it being a PITA to setup.

For Bitcoin to be a true global currency the value of BTC needs always to rise.
If BTC became the global currency & money supply = 100 Trillion then ⊅1.00 BTC = $4,761,904.76.
P2Pool Server List | How To's and Guides Mega List |  1EndfedSryGUZK9sPrdvxHntYzv2EBexGA
ThePiachu
Sr. Member
****
Offline Offline

Activity: 442



View Profile WWW
May 27, 2012, 06:19:22 PM
 #586

Hmm, the Vanitygen executable download link doesn't seem to work, can someone reupload it please?

1HWbVLhxj7bhewhyapMZpyhqWAeAhJd51E
My Bitcoin Calculator:
http://tpbitcalc.appspot.com/
nimda
Hero Member
*****
Offline Offline

Activity: 784


0xFB0D8D1534241423


View Profile
May 27, 2012, 06:21:33 PM
 #587

Sure, I had the same problem earlier.
http://www.mediafire.com/?5v8ad50eww87x20

I recommend asking me for a signature from my GPG key before doing a trade. I will NEVER deny such a request.
etsoberano
Sr. Member
****
Offline Offline

Activity: 350



View Profile WWW
May 27, 2012, 07:20:05 PM
 #588

Hi , I want to start selling  or giving out free, simple vanitygen addresses, but of course I have the problem of private key (thrust).
I already read this msg but i don't understand anything of that.
https://bitcointalk.org/index.php?topic=81865.msg901491#msg901491

Can anyone explain in a simple way (noob language) please?


฿itcoin: 1hackzqroVrD5pQCeXThfCZWB9zX7jUPJ
tynt
Member
**
Offline Offline

Activity: 61



View Profile
May 27, 2012, 09:06:20 PM
 #589

Is there any mirrors for the windows binary? Original link seems to be dead.

5830 mining for life
arne
Jr. Member
*
Offline Offline

Activity: 47



View Profile
May 27, 2012, 10:42:02 PM
 #590

https://hotfile.com/dl/156998556/99c4434/vanitygen.zip.html

1ArneR3iuAp6f48QUDJ5ZSgqJN9pP6qPB6
nimda
Hero Member
*****
Offline Offline

Activity: 784


0xFB0D8D1534241423


View Profile
May 28, 2012, 01:55:50 AM
 #591

Is there any mirrors for the windows binary? Original link seems to be dead.
If you'd prefer a non-throttled, non-ad-riddled, non-shit link which doesn't ask you to pay buckets of money for a "pro" account...
http://www.mediafire.com/?5v8ad50eww87x20

I recommend asking me for a signature from my GPG key before doing a trade. I will NEVER deny such a request.
Raoul Duke
aka psy
Legendary
*
Offline Offline

Activity: 1442



View Profile
May 28, 2012, 03:52:28 AM
 #592

Newbies posting binaries and pushing people to download theirs and not others?
Brb, gonna run this shit while I still have some bitcoins in my wallet, they deserve them.

nimda
Hero Member
*****
Offline Offline

Activity: 784


0xFB0D8D1534241423


View Profile
May 28, 2012, 03:52:59 PM
 #593

Newbies posting binaries and pushing people to download theirs and not others?
I merely have a hatred of sites which throttle and limit downloads Undecided

I recommend asking me for a signature from my GPG key before doing a trade. I will NEVER deny such a request.
BurtW
Legendary
*
Offline Offline

Activity: 1792

All paid signature campaigns should be banned.


View Profile WWW
May 30, 2012, 07:20:03 AM
 #594

Hi , I want to start selling  or giving out free, simple vanitygen addresses, but of course I have the problem of private key (thrust).
I already read this msg but i don't understand anything of that.
https://bitcointalk.org/index.php?topic=81865.msg901491#msg901491

Can anyone explain in a simple way (noob language) please?


I have posted about this subject many times.  It is very simple actually:

I generate a valid public/private key pair.
I give you the public key and keep the corresponding private key secret.
You run a modified vanitygen program that generates and finds vanity addresses.  The only modification needed is that it starts from my public key instead of the normal keypair generation point.  This should be a very easy modification to make.
Once you find the cool vanity address YOU will have a worthless private key, valid public key and a cool vanity address generated from this key pair.  The private key is worthless because it was generated from the wrong starting point on the eliptical curve (my public key).
However, if you give this "worthless" private key back to me I can use my secret private key and the private key you generated to calculate a perfectly valid and useful keypair that happens to hash to the cool vanity address.
This calculation of the final private key from the private key you send back to me and my private key is very simple.

There you go.  We just need someone to make the modification to vanitygen (and the GPU version of it) to take a public key as input to replace the standard starting point for all its key generation.  And someone to write the very simple script to take the two private keys and generate the final private key.

Our family was terrorized by Homeland Security.  Read all about it here:  http://www.jmwagner.com/ and http://www.burtw.com/  Any donations to help us recover from the $300,000 in legal fees and forced donations to the Federal Asset Forfeiture slush fund are greatly appreciated!
BurtW
Legendary
*
Offline Offline

Activity: 1792

All paid signature campaigns should be banned.


View Profile WWW
May 30, 2012, 07:28:09 AM
 #595

Math for the above is:

MYpublic = MYprivate * G

YOURpublic = YOURprivate * MYpublic

FINALpublic = YOURpublic = YOURprivate * MYpublic = (YOURprivate * MYprivate) * G

FINALprivate = YOURprivate * MYprivate

BTW this is only one of two ways to do this.

Our family was terrorized by Homeland Security.  Read all about it here:  http://www.jmwagner.com/ and http://www.burtw.com/  Any donations to help us recover from the $300,000 in legal fees and forced donations to the Federal Asset Forfeiture slush fund are greatly appreciated!
nimda
Hero Member
*****
Offline Offline

Activity: 784


0xFB0D8D1534241423


View Profile
May 30, 2012, 07:05:24 PM
 #596

Hmm, the Vanitygen executable download link doesn't seem to work, can someone reupload it please?
The post #1 sendspace link http://www.sendspace.com/file/pjgrfj seems to be working
It's been off and on for a week at least

I recommend asking me for a signature from my GPG key before doing a trade. I will NEVER deny such a request.
gweedo
Legendary
*
Offline Offline

Activity: 1246


Java, PHP, HTML/CSS Programmer for Hire!


View Profile WWW
May 31, 2012, 03:36:55 AM
 #597

Can anyone help me solve why I get this error on mac OSX 10.6.8?
Code:
% sudo make -f Makefile.osx
cc -ggdb -O3 -Wall   -c -o pattern.o pattern.c
pattern.c:32:18: error: pcre.h: No such file or directory
pattern.c:1639: error: expected specifier-qualifier-list before ‘pcre’
pattern.c: In function ‘vg_regex_context_add_patterns’:
pattern.c:1658: error: ‘vg_regex_context_t’ has no member named ‘vcr_nalloc’
pattern.c:1660: error: ‘vg_regex_context_t’ has no member named ‘vcr_nalloc’
pattern.c:1661: error: ‘vg_regex_context_t’ has no member named ‘vcr_nalloc’
pattern.c:1671: error: ‘vg_regex_context_t’ has no member named ‘vcr_regex’
pattern.c:1672: error: ‘vg_regex_context_t’ has no member named ‘vcr_regex_extra’
pattern.c:1673: error: ‘vg_regex_context_t’ has no member named ‘vcr_regex_pat’
pattern.c:1676: error: ‘vg_regex_context_t’ has no member named ‘vcr_nalloc’
pattern.c:1677: error: ‘vg_regex_context_t’ has no member named ‘vcr_regex’
pattern.c:1678: error: ‘vg_regex_context_t’ has no member named ‘vcr_regex’
pattern.c:1678: error: ‘pcre’ undeclared (first use in this function)
pattern.c:1678: error: (Each undeclared identifier is reported only once
pattern.c:1678: error: for each function it appears in.)
pattern.c:1678: error: expected expression before ‘)’ token
pattern.c:1679: error: ‘vg_regex_context_t’ has no member named ‘vcr_regex_extra’
pattern.c:1679: error: ‘pcre_extra’ undeclared (first use in this function)
pattern.c:1679: error: expected expression before ‘)’ token
pattern.c:1680: error: ‘vg_regex_context_t’ has no member named ‘vcr_regex_pat’
pattern.c:1681: error: ‘vg_regex_context_t’ has no member named ‘vcr_nalloc’
pattern.c:1686: error: ‘vg_regex_context_t’ has no member named ‘vcr_regex’
pattern.c:1687: warning: implicit declaration of function ‘pcre_compile’
pattern.c:1689: error: ‘vg_regex_context_t’ has no member named ‘vcr_regex’
pattern.c:1702: error: ‘vg_regex_context_t’ has no member named ‘vcr_regex_extra’
pattern.c:1703: warning: implicit declaration of function ‘pcre_study’
pattern.c:1703: error: ‘vg_regex_context_t’ has no member named ‘vcr_regex’
pattern.c:1706: warning: implicit declaration of function ‘pcre_free’
pattern.c:1706: error: ‘vg_regex_context_t’ has no member named ‘vcr_regex’
pattern.c:1709: error: ‘vg_regex_context_t’ has no member named ‘vcr_regex_pat’
pattern.c: In function ‘vg_regex_context_free’:
pattern.c:1727: error: ‘vg_regex_context_t’ has no member named ‘vcr_regex_extra’
pattern.c:1728: error: ‘vg_regex_context_t’ has no member named ‘vcr_regex_extra’
pattern.c:1729: error: ‘vg_regex_context_t’ has no member named ‘vcr_regex’
pattern.c:1731: error: ‘vg_regex_context_t’ has no member named ‘vcr_nalloc’
pattern.c:1732: error: ‘vg_regex_context_t’ has no member named ‘vcr_regex’
pattern.c: In function ‘vg_regex_test’:
pattern.c:1748: error: ‘pcre’ undeclared (first use in this function)
pattern.c:1748: error: ‘re’ undeclared (first use in this function)
pattern.c:1789: warning: implicit declaration of function ‘pcre_exec’
pattern.c:1789: error: ‘vg_regex_context_t’ has no member named ‘vcr_regex’
pattern.c:1790: error: ‘vg_regex_context_t’ has no member named ‘vcr_regex_extra’
pattern.c:1796: error: ‘PCRE_ERROR_NOMATCH’ undeclared (first use in this function)
pattern.c:1804: error: ‘vg_regex_context_t’ has no member named ‘vcr_regex’
pattern.c:1808: error: ‘vg_regex_context_t’ has no member named ‘vcr_regex’
pattern.c:1813: error: ‘vg_regex_context_t’ has no member named ‘vcr_regex_pat’
pattern.c:1817: error: ‘vg_regex_context_t’ has no member named ‘vcr_regex’
pattern.c:1818: error: ‘vg_regex_context_t’ has no member named ‘vcr_regex_extra’
pattern.c:1819: error: ‘vg_regex_context_t’ has no member named ‘vcr_regex_extra’
pattern.c:1826: error: ‘vg_regex_context_t’ has no member named ‘vcr_regex’
pattern.c:1826: error: ‘vg_regex_context_t’ has no member named ‘vcr_regex’
pattern.c:1827: error: ‘vg_regex_context_t’ has no member named ‘vcr_regex_extra’
pattern.c:1828: error: ‘vg_regex_context_t’ has no member named ‘vcr_regex_extra’
pattern.c:1829: error: ‘vg_regex_context_t’ has no member named ‘vcr_regex_pat’
pattern.c:1829: error: ‘vg_regex_context_t’ has no member named ‘vcr_regex_pat’
pattern.c: In function ‘vg_regex_context_new’:
pattern.c:1856: error: ‘vg_regex_context_t’ has no member named ‘vcr_regex’
pattern.c:1857: error: ‘vg_regex_context_t’ has no member named ‘vcr_nalloc’
make: *** [pattern.o] Error 1

Want to earn 2500 SATOSHIS per hour? Come Chat and Chill in https://goseemybits.com/lobby
Red Emerald
Hero Member
*****
Offline Offline

Activity: 742



View Profile WWW
June 01, 2012, 06:26:33 PM
 #598

Can anyone help me solve why I get this error on mac OSX 10.6.8?
Code:
% sudo make -f Makefile.osx
cc -ggdb -O3 -Wall   -c -o pattern.o pattern.c
pattern.c:32:18: error: pcre.h: No such file or directory
pattern.c:1639: error: expected specifier-qualifier-list before ‘pcre’
pattern.c: In function ‘vg_regex_context_add_patterns’:
pattern.c:1658: error: ‘vg_regex_context_t’ has no member named ‘vcr_nalloc’
pattern.c:1660: error: ‘vg_regex_context_t’ has no member named ‘vcr_nalloc’
pattern.c:1661: error: ‘vg_regex_context_t’ has no member named ‘vcr_nalloc’
pattern.c:1671: error: ‘vg_regex_context_t’ has no member named ‘vcr_regex’
pattern.c:1672: error: ‘vg_regex_context_t’ has no member named ‘vcr_regex_extra’
pattern.c:1673: error: ‘vg_regex_context_t’ has no member named ‘vcr_regex_pat’
pattern.c:1676: error: ‘vg_regex_context_t’ has no member named ‘vcr_nalloc’
pattern.c:1677: error: ‘vg_regex_context_t’ has no member named ‘vcr_regex’
pattern.c:1678: error: ‘vg_regex_context_t’ has no member named ‘vcr_regex’
pattern.c:1678: error: ‘pcre’ undeclared (first use in this function)
pattern.c:1678: error: (Each undeclared identifier is reported only once
pattern.c:1678: error: for each function it appears in.)
pattern.c:1678: error: expected expression before ‘)’ token
pattern.c:1679: error: ‘vg_regex_context_t’ has no member named ‘vcr_regex_extra’
pattern.c:1679: error: ‘pcre_extra’ undeclared (first use in this function)
pattern.c:1679: error: expected expression before ‘)’ token
pattern.c:1680: error: ‘vg_regex_context_t’ has no member named ‘vcr_regex_pat’
pattern.c:1681: error: ‘vg_regex_context_t’ has no member named ‘vcr_nalloc’
pattern.c:1686: error: ‘vg_regex_context_t’ has no member named ‘vcr_regex’
pattern.c:1687: warning: implicit declaration of function ‘pcre_compile’
pattern.c:1689: error: ‘vg_regex_context_t’ has no member named ‘vcr_regex’
pattern.c:1702: error: ‘vg_regex_context_t’ has no member named ‘vcr_regex_extra’
pattern.c:1703: warning: implicit declaration of function ‘pcre_study’
pattern.c:1703: error: ‘vg_regex_context_t’ has no member named ‘vcr_regex’
pattern.c:1706: warning: implicit declaration of function ‘pcre_free’
pattern.c:1706: error: ‘vg_regex_context_t’ has no member named ‘vcr_regex’
pattern.c:1709: error: ‘vg_regex_context_t’ has no member named ‘vcr_regex_pat’
pattern.c: In function ‘vg_regex_context_free’:
pattern.c:1727: error: ‘vg_regex_context_t’ has no member named ‘vcr_regex_extra’
pattern.c:1728: error: ‘vg_regex_context_t’ has no member named ‘vcr_regex_extra’
pattern.c:1729: error: ‘vg_regex_context_t’ has no member named ‘vcr_regex’
pattern.c:1731: error: ‘vg_regex_context_t’ has no member named ‘vcr_nalloc’
pattern.c:1732: error: ‘vg_regex_context_t’ has no member named ‘vcr_regex’
pattern.c: In function ‘vg_regex_test’:
pattern.c:1748: error: ‘pcre’ undeclared (first use in this function)
pattern.c:1748: error: ‘re’ undeclared (first use in this function)
pattern.c:1789: warning: implicit declaration of function ‘pcre_exec’
pattern.c:1789: error: ‘vg_regex_context_t’ has no member named ‘vcr_regex’
pattern.c:1790: error: ‘vg_regex_context_t’ has no member named ‘vcr_regex_extra’
pattern.c:1796: error: ‘PCRE_ERROR_NOMATCH’ undeclared (first use in this function)
pattern.c:1804: error: ‘vg_regex_context_t’ has no member named ‘vcr_regex’
pattern.c:1808: error: ‘vg_regex_context_t’ has no member named ‘vcr_regex’
pattern.c:1813: error: ‘vg_regex_context_t’ has no member named ‘vcr_regex_pat’
pattern.c:1817: error: ‘vg_regex_context_t’ has no member named ‘vcr_regex’
pattern.c:1818: error: ‘vg_regex_context_t’ has no member named ‘vcr_regex_extra’
pattern.c:1819: error: ‘vg_regex_context_t’ has no member named ‘vcr_regex_extra’
pattern.c:1826: error: ‘vg_regex_context_t’ has no member named ‘vcr_regex’
pattern.c:1826: error: ‘vg_regex_context_t’ has no member named ‘vcr_regex’
pattern.c:1827: error: ‘vg_regex_context_t’ has no member named ‘vcr_regex_extra’
pattern.c:1828: error: ‘vg_regex_context_t’ has no member named ‘vcr_regex_extra’
pattern.c:1829: error: ‘vg_regex_context_t’ has no member named ‘vcr_regex_pat’
pattern.c:1829: error: ‘vg_regex_context_t’ has no member named ‘vcr_regex_pat’
pattern.c: In function ‘vg_regex_context_new’:
pattern.c:1856: error: ‘vg_regex_context_t’ has no member named ‘vcr_regex’
pattern.c:1857: error: ‘vg_regex_context_t’ has no member named ‘vcr_nalloc’
make: *** [pattern.o] Error 1
"pattern.c:32:18: error: pcre.h: No such file or directory"

I think that is the part that matters.

Try using brew to 'brew install pcre' and then go again

http://mxcl.github.com/homebrew/

gweedo
Legendary
*
Offline Offline

Activity: 1246


Java, PHP, HTML/CSS Programmer for Hire!


View Profile WWW
June 01, 2012, 07:03:57 PM
 #599

Can anyone help me solve why I get this error on mac OSX 10.6.8?
Code:
% sudo make -f Makefile.osx
cc -ggdb -O3 -Wall   -c -o pattern.o pattern.c
pattern.c:32:18: error: pcre.h: No such file or directory
pattern.c:1639: error: expected specifier-qualifier-list before ‘pcre’
pattern.c: In function ‘vg_regex_context_add_patterns’:
pattern.c:1658: error: ‘vg_regex_context_t’ has no member named ‘vcr_nalloc’
pattern.c:1660: error: ‘vg_regex_context_t’ has no member named ‘vcr_nalloc’
pattern.c:1661: error: ‘vg_regex_context_t’ has no member named ‘vcr_nalloc’
pattern.c:1671: error: ‘vg_regex_context_t’ has no member named ‘vcr_regex’
pattern.c:1672: error: ‘vg_regex_context_t’ has no member named ‘vcr_regex_extra’
pattern.c:1673: error: ‘vg_regex_context_t’ has no member named ‘vcr_regex_pat’
pattern.c:1676: error: ‘vg_regex_context_t’ has no member named ‘vcr_nalloc’
pattern.c:1677: error: ‘vg_regex_context_t’ has no member named ‘vcr_regex’
pattern.c:1678: error: ‘vg_regex_context_t’ has no member named ‘vcr_regex’
pattern.c:1678: error: ‘pcre’ undeclared (first use in this function)
pattern.c:1678: error: (Each undeclared identifier is reported only once
pattern.c:1678: error: for each function it appears in.)
pattern.c:1678: error: expected expression before ‘)’ token
pattern.c:1679: error: ‘vg_regex_context_t’ has no member named ‘vcr_regex_extra’
pattern.c:1679: error: ‘pcre_extra’ undeclared (first use in this function)
pattern.c:1679: error: expected expression before ‘)’ token
pattern.c:1680: error: ‘vg_regex_context_t’ has no member named ‘vcr_regex_pat’
pattern.c:1681: error: ‘vg_regex_context_t’ has no member named ‘vcr_nalloc’
pattern.c:1686: error: ‘vg_regex_context_t’ has no member named ‘vcr_regex’
pattern.c:1687: warning: implicit declaration of function ‘pcre_compile’
pattern.c:1689: error: ‘vg_regex_context_t’ has no member named ‘vcr_regex’
pattern.c:1702: error: ‘vg_regex_context_t’ has no member named ‘vcr_regex_extra’
pattern.c:1703: warning: implicit declaration of function ‘pcre_study’
pattern.c:1703: error: ‘vg_regex_context_t’ has no member named ‘vcr_regex’
pattern.c:1706: warning: implicit declaration of function ‘pcre_free’
pattern.c:1706: error: ‘vg_regex_context_t’ has no member named ‘vcr_regex’
pattern.c:1709: error: ‘vg_regex_context_t’ has no member named ‘vcr_regex_pat’
pattern.c: In function ‘vg_regex_context_free’:
pattern.c:1727: error: ‘vg_regex_context_t’ has no member named ‘vcr_regex_extra’
pattern.c:1728: error: ‘vg_regex_context_t’ has no member named ‘vcr_regex_extra’
pattern.c:1729: error: ‘vg_regex_context_t’ has no member named ‘vcr_regex’
pattern.c:1731: error: ‘vg_regex_context_t’ has no member named ‘vcr_nalloc’
pattern.c:1732: error: ‘vg_regex_context_t’ has no member named ‘vcr_regex’
pattern.c: In function ‘vg_regex_test’:
pattern.c:1748: error: ‘pcre’ undeclared (first use in this function)
pattern.c:1748: error: ‘re’ undeclared (first use in this function)
pattern.c:1789: warning: implicit declaration of function ‘pcre_exec’
pattern.c:1789: error: ‘vg_regex_context_t’ has no member named ‘vcr_regex’
pattern.c:1790: error: ‘vg_regex_context_t’ has no member named ‘vcr_regex_extra’
pattern.c:1796: error: ‘PCRE_ERROR_NOMATCH’ undeclared (first use in this function)
pattern.c:1804: error: ‘vg_regex_context_t’ has no member named ‘vcr_regex’
pattern.c:1808: error: ‘vg_regex_context_t’ has no member named ‘vcr_regex’
pattern.c:1813: error: ‘vg_regex_context_t’ has no member named ‘vcr_regex_pat’
pattern.c:1817: error: ‘vg_regex_context_t’ has no member named ‘vcr_regex’
pattern.c:1818: error: ‘vg_regex_context_t’ has no member named ‘vcr_regex_extra’
pattern.c:1819: error: ‘vg_regex_context_t’ has no member named ‘vcr_regex_extra’
pattern.c:1826: error: ‘vg_regex_context_t’ has no member named ‘vcr_regex’
pattern.c:1826: error: ‘vg_regex_context_t’ has no member named ‘vcr_regex’
pattern.c:1827: error: ‘vg_regex_context_t’ has no member named ‘vcr_regex_extra’
pattern.c:1828: error: ‘vg_regex_context_t’ has no member named ‘vcr_regex_extra’
pattern.c:1829: error: ‘vg_regex_context_t’ has no member named ‘vcr_regex_pat’
pattern.c:1829: error: ‘vg_regex_context_t’ has no member named ‘vcr_regex_pat’
pattern.c: In function ‘vg_regex_context_new’:
pattern.c:1856: error: ‘vg_regex_context_t’ has no member named ‘vcr_regex’
pattern.c:1857: error: ‘vg_regex_context_t’ has no member named ‘vcr_nalloc’
make: *** [pattern.o] Error 1
"pattern.c:32:18: error: pcre.h: No such file or directory"

I think that is the part that matters.

Try using brew to 'brew install pcre' and then go again

http://mxcl.github.com/homebrew/

Thanks works perfect

Want to earn 2500 SATOSHIS per hour? Come Chat and Chill in https://goseemybits.com/lobby
Xenland
Legendary
*
Offline Offline

Activity: 980


I'm not just any shaman, I'm a Sha256man


View Profile
June 03, 2012, 06:18:33 AM
 #600

Time to test this vanity thing out for once!
Pages: « 1 2 3 4 5 6 7 8 9 10 11 12 13 14 15 16 17 18 19 20 21 22 23 24 25 26 27 28 29 [30] 31 32 33 34 35 36 37 38 39 40 41 42 43 44 45 46 47 48 49 50 51 52 53 54 55 56 57 58 59 60 61 62 63 64 65 66 67 68 69 70 71 72 73 74 75 76 77 78 79 80 ... 155 »
  Print  
 
Jump to:  

Sponsored by , a Bitcoin-accepting VPN.
Powered by MySQL Powered by PHP Powered by SMF 1.1.19 | SMF © 2006-2009, Simple Machines Valid XHTML 1.0! Valid CSS!